{"text_format":"1","workbook":"xlsx","n_sheets":4,"sheets":["To Do List ","Sources","Sheet2","Task Matrix"],"not_rendered":{"charts":0,"images":1,"macros":1,"external_links":0,"defined_names":1,"comments":0,"pivot_tables":0},"unopened":[],"bounds":{"document_bytes":16777216,"sheet_cells":100000,"rows_first":2000,"rows_last":500,"rows_between":2000,"halvings":0,"cell_chars":16384,"cell_head_chars":4096},"cells_cut":0,"cells_raw":0,"read":"whole","date_system":"1900"}

{"sheet":"To Do List ","index":0,"n_rows":52,"n_cols":4,"rows_kept":52,"cut":false,"hidden":false,"merged":[]}
[]
[null,"Aktivitäten","Wichtig","Dringend"]
[null,"Projekt Kickoff planen","Ja","Ja"]
[null,"Abrechnung machen","Nein","Ja"]
[null,"Besprechung mit XY durchführen","Ja","Nein"]
[null,"Teammeeting planen","Ja","Ja"]
[null,"CC-Emails lesen","Nein","Nein"]
[null,"Risikomanagement durchführen","Ja","Nein"]
[]
[]
[]
[]
[]
[]
[]
{"$rows_left_out":38}
{"sheet":"Sources","index":1,"n_rows":0,"n_cols":0,"rows_kept":0,"cut":false,"hidden":true,"merged":[]}

{"sheet":"Sheet2","index":2,"n_rows":61,"n_cols":18,"rows_kept":61,"cut":false,"hidden":true,"merged":[]}
[]
[null,"Ja",null,null,"Important & Urgent","Important","Urgent","None",null,"Important & Urgent","Important","Urgent","None",null,"Important & Urgent","Important","Urgent","None"]
[null,"Nein",{"$f":"IF('To Do List '!#REF!=Sheet2!$A$15,TRUE,FALSE)","v":{"$error":"#REF!"}},null,{"$f":"IF(AND('To Do List '!C3=\"Ja\",'To Do List '!D3=\"Ja\"),'To Do List '!B3,\"\")","v":"Projekt Kickoff planen"},{"$f":"IF(AND('To Do List '!C3=\"Ja\",'To Do List '!D3=\"Nein\"),'To Do List '!B3,\"\")","v":""},{"$f":"IF(AND('To Do List '!C3=\"Nein\",'To Do List '!D3=\"Ja\"),'To Do List '!B3,\"\")","v":""},{"$f":"IF(AND('To Do List '!C3=\"Nein\",'To Do List '!D3=\"Nein\"),'To Do List '!B3,\"\")","v":""},null,{"$f":"IF(E3<>\"\",ROWS($I$3:I3),\"\")","v":1},{"$f":"IF(F3<>\"\",ROWS($I$3:J3),\"\")","v":""},{"$f":"IF(G3<>\"\",ROWS($I$3:K3),\"\")","v":""},{"$f":"IF(H3<>\"\",ROWS($I$3:L3),\"\")","v":""},{"$f":"INDEX($C$3:$C$52,SMALL($J$3:$J$52,ROWS($S$3:S3)+$B$6-1))","v":{"$error":"#REF!"}},{"$f":"IFERROR(IF(INDEX(E$3:E$52,SMALL(J$3:J$52,ROWS($N$3:N3)+$B$6-1))<>\"\",CHAR(149)& \" \"&INDEX(E$3:E$52,SMALL(J$3:J$52,ROWS($N$3:N3)+$B$6-1)),\"\"),\"\")","v":"• Projekt Kickoff planen"},{"$f":"IFERROR(IF(INDEX(F$3:F$52,SMALL(K$3:K$52,ROWS($N$3:O3)+$B$7-1))<>\"\",CHAR(149)& \" \"&INDEX(F$3:F$52,SMALL(K$3:K$52,ROWS($N$3:O3)+$B$7-1)),\"\"),\"\")","v":"• Besprechung mit XY durchführen"},{"$f":"IFERROR(IF(INDEX(G$3:G$52,SMALL(L$3:L$52,ROWS($N$3:P3)+$B$8-1))<>\"\",CHAR(149)& \" \"&INDEX(G$3:G$52,SMALL(L$3:L$52,ROWS($N$3:P3)+$B$8-1)),\"\"),\"\")","v":"• Abrechnung machen"},{"$f":"IFERROR(IF(INDEX(H$3:H$52,SMALL(M$3:M$52,ROWS($N$3:Q3)+$B$7-1))<>\"\",CHAR(149)& \" \"&INDEX(H$3:H$52,SMALL(M$3:M$52,ROWS($N$3:Q3)+$B$7-1)),\"\"),\"\")","v":"• CC-Emails lesen"}]
[null,null,{"$f":"IF('To Do List '!#REF!=Sheet2!$A$15,TRUE,FALSE)","v":{"$error":"#REF!"}},null,{"$f":"IF(AND('To Do List '!C4=\"Ja\",'To Do List '!D4=\"Ja\"),'To Do List '!B4,\"\")","v":""},{"$f":"IF(AND('To Do List '!C4=\"Ja\",'To Do List '!D4=\"Nein\"),'To Do List '!B4,\"\")","v":""},{"$f":"IF(AND('To Do List '!C4=\"Nein\",'To Do List '!D4=\"Ja\"),'To Do List '!B4,\"\")","v":"Abrechnung machen"},{"$f":"IF(AND('To Do List '!C4=\"Nein\",'To Do List '!D4=\"Nein\"),'To Do List '!B4,\"\")","v":""},null,{"$f":"IF(E4<>\"\",ROWS($I$3:I4),\"\")","v":""},{"$f":"IF(F4<>\"\",ROWS($I$3:J4),\"\")","v":""},{"$f":"IF(G4<>\"\",ROWS($I$3:K4),\"\")","v":2},{"$f":"IF(H4<>\"\",ROWS($I$3:L4),\"\")","v":""},{"$f":"INDEX($C$3:$C$52,SMALL($J$3:$J$52,ROWS($S$3:S4)+$B$6-1))","v":{"$error":"#REF!"}},{"$f":"IFERROR(IF(INDEX(E$3:E$52,SMALL(J$3:J$52,ROWS($N$3:N4)+$B$6-1))<>\"\",CHAR(149)& \" \"&INDEX(E$3:E$52,SMALL(J$3:J$52,ROWS($N$3:N4)+$B$6-1)),\"\"),\"\")","v":"• Teammeeting planen"},{"$f":"IFERROR(IF(INDEX(F$3:F$52,SMALL(K$3:K$52,ROWS($N$3:O4)+$B$7-1))<>\"\",CHAR(149)& \" \"&INDEX(F$3:F$52,SMALL(K$3:K$52,ROWS($N$3:O4)+$B$7-1)),\"\"),\"\")","v":"• Risikomanagement durchführen"},{"$f":"IFERROR(IF(INDEX(G$3:G$52,SMALL(L$3:L$52,ROWS($N$3:P4)+$B$8-1))<>\"\",CHAR(149)& \" \"&INDEX(G$3:G$52,SMALL(L$3:L$52,ROWS($N$3:P4)+$B$8-1)),\"\"),\"\")","v":""},{"$f":"IFERROR(IF(INDEX(H$3:H$52,SMALL(M$3:M$52,ROWS($N$3:Q4)+$B$9-1))<>\"\",CHAR(149)& \" \"&INDEX(H$3:H$52,SMALL(M$3:M$52,ROWS($N$3:Q4)+$B$9-1)),\"\"),\"\")","v":""}]
[null,null,{"$f":"IF('To Do List '!#REF!=Sheet2!$A$15,TRUE,FALSE)","v":{"$error":"#REF!"}},null,{"$f":"IF(AND('To Do List '!C5=\"Ja\",'To Do List '!D5=\"Ja\"),'To Do List '!B5,\"\")","v":""},{"$f":"IF(AND('To Do List '!C5=\"Ja\",'To Do List '!D5=\"Nein\"),'To Do List '!B5,\"\")","v":"Besprechung mit XY durchführen"},{"$f":"IF(AND('To Do List '!C5=\"Nein\",'To Do List '!D5=\"Ja\"),'To Do List '!B5,\"\")","v":""},{"$f":"IF(AND('To Do List '!C5=\"Nein\",'To Do List '!D5=\"Nein\"),'To Do List '!B5,\"\")","v":""},null,{"$f":"IF(E5<>\"\",ROWS($I$3:I5),\"\")","v":""},{"$f":"IF(F5<>\"\",ROWS($I$3:J5),\"\")","v":3},{"$f":"IF(G5<>\"\",ROWS($I$3:K5),\"\")","v":""},{"$f":"IF(H5<>\"\",ROWS($I$3:L5),\"\")","v":""},{"$f":"INDEX($C$3:$C$52,SMALL($J$3:$J$52,ROWS($S$3:S5)+$B$6-1))","v":{"$error":"#NUM!"}},{"$f":"IFERROR(IF(INDEX(E$3:E$52,SMALL(J$3:J$52,ROWS($N$3:N5)+$B$6-1))<>\"\",CHAR(149)& \" \"&INDEX(E$3:E$52,SMALL(J$3:J$52,ROWS($N$3:N5)+$B$6-1)),\"\"),\"\")","v":""},{"$f":"IFERROR(IF(INDEX(F$3:F$52,SMALL(K$3:K$52,ROWS($N$3:O5)+$B$7-1))<>\"\",CHAR(149)& \" \"&INDEX(F$3:F$52,SMALL(K$3:K$52,ROWS($N$3:O5)+$B$7-1)),\"\"),\"\")","v":""},{"$f":"IFERROR(IF(INDEX(G$3:G$52,SMALL(L$3:L$52,ROWS($N$3:P5)+$B$8-1))<>\"\",CHAR(149)& \" \"&INDEX(G$3:G$52,SMALL(L$3:L$52,ROWS($N$3:P5)+$B$8-1)),\"\"),\"\")","v":""},{"$f":"IFERROR(IF(INDEX(H$3:H$52,SMALL(M$3:M$52,ROWS($N$3:Q5)+$B$9-1))<>\"\",CHAR(149)& \" \"&INDEX(H$3:H$52,SMALL(M$3:M$52,ROWS($N$3:Q5)+$B$9-1)),\"\"),\"\")","v":""}]
["Scroll Bar - Imp and Urgent",1,{"$f":"IF('To Do List '!#REF!=Sheet2!$A$15,TRUE,FALSE)","v":{"$error":"#REF!"}},null,{"$f":"IF(AND('To Do List '!C6=\"Ja\",'To Do List '!D6=\"Ja\"),'To Do List '!B6,\"\")","v":"Teammeeting planen"},{"$f":"IF(AND('To Do List '!C6=\"Ja\",'To Do List '!D6=\"Nein\"),'To Do List '!B6,\"\")","v":""},{"$f":"IF(AND('To Do List '!C6=\"Nein\",'To Do List '!D6=\"Ja\"),'To Do List '!B6,\"\")","v":""},{"$f":"IF(AND('To Do List '!C6=\"Nein\",'To Do List '!D6=\"Nein\"),'To Do List '!B6,\"\")","v":""},null,{"$f":"IF(E6<>\"\",ROWS($I$3:I6),\"\")","v":4},{"$f":"IF(F6<>\"\",ROWS($I$3:J6),\"\")","v":""},{"$f":"IF(G6<>\"\",ROWS($I$3:K6),\"\")","v":""},{"$f":"IF(H6<>\"\",ROWS($I$3:L6),\"\")","v":""},{"$f":"INDEX($C$3:$C$52,SMALL($J$3:$J$52,ROWS($S$3:S6)+$B$6-1))","v":{"$error":"#NUM!"}},{"$f":"IFERROR(IF(INDEX(E$3:E$52,SMALL(J$3:J$52,ROWS($N$3:N6)+$B$6-1))<>\"\",CHAR(149)& \" \"&INDEX(E$3:E$52,SMALL(J$3:J$52,ROWS($N$3:N6)+$B$6-1)),\"\"),\"\")","v":""},{"$f":"IFERROR(IF(INDEX(F$3:F$52,SMALL(K$3:K$52,ROWS($N$3:O6)+$B$7-1))<>\"\",CHAR(149)& \" \"&INDEX(F$3:F$52,SMALL(K$3:K$52,ROWS($N$3:O6)+$B$7-1)),\"\"),\"\")","v":""},{"$f":"IFERROR(IF(INDEX(G$3:G$52,SMALL(L$3:L$52,ROWS($N$3:P6)+$B$8-1))<>\"\",CHAR(149)& \" \"&INDEX(G$3:G$52,SMALL(L$3:L$52,ROWS($N$3:P6)+$B$8-1)),\"\"),\"\")","v":""},{"$f":"IFERROR(IF(INDEX(H$3:H$52,SMALL(M$3:M$52,ROWS($N$3:Q6)+$B$9-1))<>\"\",CHAR(149)& \" \"&INDEX(H$3:H$52,SMALL(M$3:M$52,ROWS($N$3:Q6)+$B$9-1)),\"\"),\"\")","v":""}]
[null,1,{"$f":"IF('To Do List '!#REF!=Sheet2!$A$15,TRUE,FALSE)","v":{"$error":"#REF!"}},null,{"$f":"IF(AND('To Do List '!C7=\"Ja\",'To Do List '!D7=\"Ja\"),'To Do List '!B7,\"\")","v":""},{"$f":"IF(AND('To Do List '!C7=\"Ja\",'To Do List '!D7=\"Nein\"),'To Do List '!B7,\"\")","v":""},{"$f":"IF(AND('To Do List '!C7=\"Nein\",'To Do List '!D7=\"Ja\"),'To Do List '!B7,\"\")","v":""},{"$f":"IF(AND('To Do List '!C7=\"Nein\",'To Do List '!D7=\"Nein\"),'To Do List '!B7,\"\")","v":"CC-Emails lesen"},null,{"$f":"IF(E7<>\"\",ROWS($I$3:I7),\"\")","v":""},{"$f":"IF(F7<>\"\",ROWS($I$3:J7),\"\")","v":""},{"$f":"IF(G7<>\"\",ROWS($I$3:K7),\"\")","v":""},{"$f":"IF(H7<>\"\",ROWS($I$3:L7),\"\")","v":5},{"$f":"INDEX($C$3:$C$52,SMALL($J$3:$J$52,ROWS($S$3:S7)+$B$6-1))","v":{"$error":"#NUM!"}},{"$f":"IFERROR(IF(INDEX(E$3:E$52,SMALL(J$3:J$52,ROWS($N$3:N7)+$B$6-1))<>\"\",CHAR(149)& \" \"&INDEX(E$3:E$52,SMALL(J$3:J$52,ROWS($N$3:N7)+$B$6-1)),\"\"),\"\")","v":""},{"$f":"IFERROR(IF(INDEX(F$3:F$52,SMALL(K$3:K$52,ROWS($N$3:O7)+$B$7-1))<>\"\",CHAR(149)& \" \"&INDEX(F$3:F$52,SMALL(K$3:K$52,ROWS($N$3:O7)+$B$7-1)),\"\"),\"\")","v":""},{"$f":"IFERROR(IF(INDEX(G$3:G$52,SMALL(L$3:L$52,ROWS($N$3:P7)+$B$8-1))<>\"\",CHAR(149)& \" \"&INDEX(G$3:G$52,SMALL(L$3:L$52,ROWS($N$3:P7)+$B$8-1)),\"\"),\"\")","v":""},{"$f":"IFERROR(IF(INDEX(H$3:H$52,SMALL(M$3:M$52,ROWS($N$3:Q7)+$B$9-1))<>\"\",CHAR(149)& \" \"&INDEX(H$3:H$52,SMALL(M$3:M$52,ROWS($N$3:Q7)+$B$9-1)),\"\"),\"\")","v":""}]
[null,1,{"$f":"IF('To Do List '!#REF!=Sheet2!$A$15,TRUE,FALSE)","v":{"$error":"#REF!"}},null,{"$f":"IF(AND('To Do List '!C8=\"Ja\",'To Do List '!D8=\"Ja\"),'To Do List '!B8,\"\")","v":""},{"$f":"IF(AND('To Do List '!C8=\"Ja\",'To Do List '!D8=\"Nein\"),'To Do List '!B8,\"\")","v":"Risikomanagement durchführen"},{"$f":"IF(AND('To Do List '!C8=\"Nein\",'To Do List '!D8=\"Ja\"),'To Do List '!B8,\"\")","v":""},{"$f":"IF(AND('To Do List '!C8=\"Nein\",'To Do List '!D8=\"Nein\"),'To Do List '!B8,\"\")","v":""},null,{"$f":"IF(E8<>\"\",ROWS($I$3:I8),\"\")","v":""},{"$f":"IF(F8<>\"\",ROWS($I$3:J8),\"\")","v":6},{"$f":"IF(G8<>\"\",ROWS($I$3:K8),\"\")","v":""},{"$f":"IF(H8<>\"\",ROWS($I$3:L8),\"\")","v":""},{"$f":"INDEX($C$3:$C$52,SMALL($J$3:$J$52,ROWS($S$3:S8)+$B$6-1))","v":{"$error":"#NUM!"}},{"$f":"IFERROR(IF(INDEX(E$3:E$52,SMALL(J$3:J$52,ROWS($N$3:N8)+$B$6-1))<>\"\",CHAR(149)& \" \"&INDEX(E$3:E$52,SMALL(J$3:J$52,ROWS($N$3:N8)+$B$6-1)),\"\"),\"\")","v":""},{"$f":"IFERROR(IF(INDEX(F$3:F$52,SMALL(K$3:K$52,ROWS($N$3:O8)+$B$7-1))<>\"\",CHAR(149)& \" \"&INDEX(F$3:F$52,SMALL(K$3:K$52,ROWS($N$3:O8)+$B$7-1)),\"\"),\"\")","v":""},{"$f":"IFERROR(IF(INDEX(G$3:G$52,SMALL(L$3:L$52,ROWS($N$3:P8)+$B$8-1))<>\"\",CHAR(149)& \" \"&INDEX(G$3:G$52,SMALL(L$3:L$52,ROWS($N$3:P8)+$B$8-1)),\"\"),\"\")","v":""},{"$f":"IFERROR(IF(INDEX(H$3:H$52,SMALL(M$3:M$52,ROWS($N$3:Q8)+$B$9-1))<>\"\",CHAR(149)& \" \"&INDEX(H$3:H$52,SMALL(M$3:M$52,ROWS($N$3:Q8)+$B$9-1)),\"\"),\"\")","v":""}]
[null,1,{"$f":"IF('To Do List '!#REF!=Sheet2!$A$15,TRUE,FALSE)","v":{"$error":"#REF!"}},null,{"$f":"IF(AND('To Do List '!C9=\"Ja\",'To Do List '!D9=\"Ja\"),'To Do List '!B9,\"\")","v":""},{"$f":"IF(AND('To Do List '!C9=\"Ja\",'To Do List '!D9=\"Nein\"),'To Do List '!B9,\"\")","v":""},{"$f":"IF(AND('To Do List '!C9=\"Nein\",'To Do List '!D9=\"Ja\"),'To Do List '!B9,\"\")","v":""},{"$f":"IF(AND('To Do List '!C9=\"Nein\",'To Do List '!D9=\"Nein\"),'To Do List '!B9,\"\")","v":""},null,{"$f":"IF(E9<>\"\",ROWS($I$3:I9),\"\")","v":""},{"$f":"IF(F9<>\"\",ROWS($I$3:J9),\"\")","v":""},{"$f":"IF(G9<>\"\",ROWS($I$3:K9),\"\")","v":""},{"$f":"IF(H9<>\"\",ROWS($I$3:L9),\"\")","v":""},{"$f":"INDEX($C$3:$C$52,SMALL($J$3:$J$52,ROWS($S$3:S9)+$B$6-1))","v":{"$error":"#NUM!"}},{"$f":"IFERROR(IF(INDEX(E$3:E$52,SMALL(J$3:J$52,ROWS($N$3:N9)+$B$6-1))<>\"\",CHAR(149)& \" \"&INDEX(E$3:E$52,SMALL(J$3:J$52,ROWS($N$3:N9)+$B$6-1)),\"\"),\"\")","v":""},{"$f":"IFERROR(IF(INDEX(F$3:F$52,SMALL(K$3:K$52,ROWS($N$3:O9)+$B$7-1))<>\"\",CHAR(149)& \" \"&INDEX(F$3:F$52,SMALL(K$3:K$52,ROWS($N$3:O9)+$B$7-1)),\"\"),\"\")","v":""},{"$f":"IFERROR(IF(INDEX(G$3:G$52,SMALL(L$3:L$52,ROWS($N$3:P9)+$B$8-1))<>\"\",CHAR(149)& \" \"&INDEX(G$3:G$52,SMALL(L$3:L$52,ROWS($N$3:P9)+$B$8-1)),\"\"),\"\")","v":""},{"$f":"IFERROR(IF(INDEX(H$3:H$52,SMALL(M$3:M$52,ROWS($N$3:Q9)+$B$9-1))<>\"\",CHAR(149)& \" \"&INDEX(H$3:H$52,SMALL(M$3:M$52,ROWS($N$3:Q9)+$B$9-1)),\"\"),\"\")","v":""}]
[null,null,{"$f":"IF('To Do List '!#REF!=Sheet2!$A$15,TRUE,FALSE)","v":{"$error":"#REF!"}},null,{"$f":"IF(AND('To Do List '!C10=\"Ja\",'To Do List '!D10=\"Ja\"),'To Do List '!B10,\"\")","v":""},{"$f":"IF(AND('To Do List '!C10=\"Ja\",'To Do List '!D10=\"Nein\"),'To Do List '!B10,\"\")","v":""},{"$f":"IF(AND('To Do List '!C10=\"Nein\",'To Do List '!D10=\"Ja\"),'To Do List '!B10,\"\")","v":""},{"$f":"IF(AND('To Do List '!C10=\"Nein\",'To Do List '!D10=\"Nein\"),'To Do List '!B10,\"\")","v":""},null,{"$f":"IF(E10<>\"\",ROWS($I$3:I10),\"\")","v":""},{"$f":"IF(F10<>\"\",ROWS($I$3:J10),\"\")","v":""},{"$f":"IF(G10<>\"\",ROWS($I$3:K10),\"\")","v":""},{"$f":"IF(H10<>\"\",ROWS($I$3:L10),\"\")","v":""},{"$f":"INDEX($C$3:$C$52,SMALL($J$3:$J$52,ROWS($S$3:S10)+$B$6-1))","v":{"$error":"#NUM!"}},{"$f":"IFERROR(IF(INDEX(E$3:E$52,SMALL(J$3:J$52,ROWS($N$3:N10)+$B$6-1))<>\"\",CHAR(149)& \" \"&INDEX(E$3:E$52,SMALL(J$3:J$52,ROWS($N$3:N10)+$B$6-1)),\"\"),\"\")","v":""},{"$f":"IFERROR(IF(INDEX(F$3:F$52,SMALL(K$3:K$52,ROWS($N$3:O10)+$B$7-1))<>\"\",CHAR(149)& \" \"&INDEX(F$3:F$52,SMALL(K$3:K$52,ROWS($N$3:O10)+$B$7-1)),\"\"),\"\")","v":""},{"$f":"IFERROR(IF(INDEX(G$3:G$52,SMALL(L$3:L$52,ROWS($N$3:P10)+$B$8-1))<>\"\",CHAR(149)& \" \"&INDEX(G$3:G$52,SMALL(L$3:L$52,ROWS($N$3:P10)+$B$8-1)),\"\"),\"\")","v":""},{"$f":"IFERROR(IF(INDEX(H$3:H$52,SMALL(M$3:M$52,ROWS($N$3:Q10)+$B$9-1))<>\"\",CHAR(149)& \" \"&INDEX(H$3:H$52,SMALL(M$3:M$52,ROWS($N$3:Q10)+$B$9-1)),\"\"),\"\")","v":""}]
[null,null,{"$f":"IF('To Do List '!#REF!=Sheet2!$A$15,TRUE,FALSE)","v":{"$error":"#REF!"}},null,{"$f":"IF(AND('To Do List '!C11=\"Ja\",'To Do List '!D11=\"Ja\"),'To Do List '!B11,\"\")","v":""},{"$f":"IF(AND('To Do List '!C11=\"Ja\",'To Do List '!D11=\"Nein\"),'To Do List '!B11,\"\")","v":""},{"$f":"IF(AND('To Do List '!C11=\"Nein\",'To Do List '!D11=\"Ja\"),'To Do List '!B11,\"\")","v":""},{"$f":"IF(AND('To Do List '!C11=\"Nein\",'To Do List '!D11=\"Nein\"),'To Do List '!B11,\"\")","v":""},null,{"$f":"IF(E11<>\"\",ROWS($I$3:I11),\"\")","v":""},{"$f":"IF(F11<>\"\",ROWS($I$3:J11),\"\")","v":""},{"$f":"IF(G11<>\"\",ROWS($I$3:K11),\"\")","v":""},{"$f":"IF(H11<>\"\",ROWS($I$3:L11),\"\")","v":""},null,{"$f":"IFERROR(IF(INDEX(E$3:E$52,SMALL(J$3:J$52,ROWS($N$3:N11)+$B$6-1))<>\"\",CHAR(149)& \" \"&INDEX(E$3:E$52,SMALL(J$3:J$52,ROWS($N$3:N11)+$B$6-1)),\"\"),\"\")","v":""},{"$f":"IFERROR(IF(INDEX(F$3:F$52,SMALL(K$3:K$52,ROWS($N$3:O11)+$B$7-1))<>\"\",CHAR(149)& \" \"&INDEX(F$3:F$52,SMALL(K$3:K$52,ROWS($N$3:O11)+$B$7-1)),\"\"),\"\")","v":""},{"$f":"IFERROR(IF(INDEX(G$3:G$52,SMALL(L$3:L$52,ROWS($N$3:P11)+$B$8-1))<>\"\",CHAR(149)& \" \"&INDEX(G$3:G$52,SMALL(L$3:L$52,ROWS($N$3:P11)+$B$8-1)),\"\"),\"\")","v":""},{"$f":"IFERROR(IF(INDEX(H$3:H$52,SMALL(M$3:M$52,ROWS($N$3:Q11)+$B$9-1))<>\"\",CHAR(149)& \" \"&INDEX(H$3:H$52,SMALL(M$3:M$52,ROWS($N$3:Q11)+$B$9-1)),\"\"),\"\")","v":""}]
["Status Options",null,{"$f":"IF('To Do List '!#REF!=Sheet2!$A$15,TRUE,FALSE)","v":{"$error":"#REF!"}},null,{"$f":"IF(AND('To Do List '!C12=\"Ja\",'To Do List '!D12=\"Ja\"),'To Do List '!B12,\"\")","v":""},{"$f":"IF(AND('To Do List '!C12=\"Ja\",'To Do List '!D12=\"Nein\"),'To Do List '!B12,\"\")","v":""},{"$f":"IF(AND('To Do List '!C12=\"Nein\",'To Do List '!D12=\"Ja\"),'To Do List '!B12,\"\")","v":""},{"$f":"IF(AND('To Do List '!C12=\"Nein\",'To Do List '!D12=\"Nein\"),'To Do List '!B12,\"\")","v":""},null,{"$f":"IF(E12<>\"\",ROWS($I$3:I12),\"\")","v":""},{"$f":"IF(F12<>\"\",ROWS($I$3:J12),\"\")","v":""},{"$f":"IF(G12<>\"\",ROWS($I$3:K12),\"\")","v":""},{"$f":"IF(H12<>\"\",ROWS($I$3:L12),\"\")","v":""},null,{"$f":"IFERROR(IF(INDEX(E$3:E$52,SMALL(J$3:J$52,ROWS($N$3:N12)+$B$6-1))<>\"\",CHAR(149)& \" \"&INDEX(E$3:E$52,SMALL(J$3:J$52,ROWS($N$3:N12)+$B$6-1)),\"\"),\"\")","v":""},{"$f":"IFERROR(IF(INDEX(F$3:F$52,SMALL(K$3:K$52,ROWS($N$3:O12)+$B$7-1))<>\"\",CHAR(149)& \" \"&INDEX(F$3:F$52,SMALL(K$3:K$52,ROWS($N$3:O12)+$B$7-1)),\"\"),\"\")","v":""},{"$f":"IFERROR(IF(INDEX(G$3:G$52,SMALL(L$3:L$52,ROWS($N$3:P12)+$B$8-1))<>\"\",CHAR(149)& \" \"&INDEX(G$3:G$52,SMALL(L$3:L$52,ROWS($N$3:P12)+$B$8-1)),\"\"),\"\")","v":""},{"$f":"IFERROR(IF(INDEX(H$3:H$52,SMALL(M$3:M$52,ROWS($N$3:Q12)+$B$9-1))<>\"\",CHAR(149)& \" \"&INDEX(H$3:H$52,SMALL(M$3:M$52,ROWS($N$3:Q12)+$B$9-1)),\"\"),\"\")","v":""}]
["To be Started",null,{"$f":"IF('To Do List '!#REF!=Sheet2!$A$15,TRUE,FALSE)","v":{"$error":"#REF!"}},null,{"$f":"IF(AND('To Do List '!C13=\"Ja\",'To Do List '!D13=\"Ja\"),'To Do List '!B13,\"\")","v":""},{"$f":"IF(AND('To Do List '!C13=\"Ja\",'To Do List '!D13=\"Nein\"),'To Do List '!B13,\"\")","v":""},{"$f":"IF(AND('To Do List '!C13=\"Nein\",'To Do List '!D13=\"Ja\"),'To Do List '!B13,\"\")","v":""},{"$f":"IF(AND('To Do List '!C13=\"Nein\",'To Do List '!D13=\"Nein\"),'To Do List '!B13,\"\")","v":""},null,{"$f":"IF(E13<>\"\",ROWS($I$3:I13),\"\")","v":""},{"$f":"IF(F13<>\"\",ROWS($I$3:J13),\"\")","v":""},{"$f":"IF(G13<>\"\",ROWS($I$3:K13),\"\")","v":""},{"$f":"IF(H13<>\"\",ROWS($I$3:L13),\"\")","v":""},null,{"$f":"IFERROR(IF(INDEX(E$3:E$52,SMALL(J$3:J$52,ROWS($N$3:N13)+$B$6-1))<>\"\",CHAR(149)& \" \"&INDEX(E$3:E$52,SMALL(J$3:J$52,ROWS($N$3:N13)+$B$6-1)),\"\"),\"\")","v":""},{"$f":"IFERROR(IF(INDEX(F$3:F$52,SMALL(K$3:K$52,ROWS($N$3:O13)+$B$7-1))<>\"\",CHAR(149)& \" \"&INDEX(F$3:F$52,SMALL(K$3:K$52,ROWS($N$3:O13)+$B$7-1)),\"\"),\"\")","v":""},{"$f":"IFERROR(IF(INDEX(G$3:G$52,SMALL(L$3:L$52,ROWS($N$3:P13)+$B$8-1))<>\"\",CHAR(149)& \" \"&INDEX(G$3:G$52,SMALL(L$3:L$52,ROWS($N$3:P13)+$B$8-1)),\"\"),\"\")","v":""},{"$f":"IFERROR(IF(INDEX(H$3:H$52,SMALL(M$3:M$52,ROWS($N$3:Q13)+$B$9-1))<>\"\",CHAR(149)& \" \"&INDEX(H$3:H$52,SMALL(M$3:M$52,ROWS($N$3:Q13)+$B$9-1)),\"\"),\"\")","v":""}]
["In-Progress",null,{"$f":"IF('To Do List '!#REF!=Sheet2!$A$15,TRUE,FALSE)","v":{"$error":"#REF!"}},null,{"$f":"IF(AND('To Do List '!C14=\"Ja\",'To Do List '!D14=\"Ja\"),'To Do List '!B14,\"\")","v":""},{"$f":"IF(AND('To Do List '!C14=\"Ja\",'To Do List '!D14=\"Nein\"),'To Do List '!B14,\"\")","v":""},{"$f":"IF(AND('To Do List '!C14=\"Nein\",'To Do List '!D14=\"Ja\"),'To Do List '!B14,\"\")","v":""},{"$f":"IF(AND('To Do List '!C14=\"Nein\",'To Do List '!D14=\"Nein\"),'To Do List '!B14,\"\")","v":""},null,{"$f":"IF(E14<>\"\",ROWS($I$3:I14),\"\")","v":""},{"$f":"IF(F14<>\"\",ROWS($I$3:J14),\"\")","v":""},{"$f":"IF(G14<>\"\",ROWS($I$3:K14),\"\")","v":""},{"$f":"IF(H14<>\"\",ROWS($I$3:L14),\"\")","v":""},null,{"$f":"IFERROR(IF(INDEX(E$3:E$52,SMALL(J$3:J$52,ROWS($N$3:N14)+$B$6-1))<>\"\",CHAR(149)& \" \"&INDEX(E$3:E$52,SMALL(J$3:J$52,ROWS($N$3:N14)+$B$6-1)),\"\"),\"\")","v":""},{"$f":"IFERROR(IF(INDEX(F$3:F$52,SMALL(K$3:K$52,ROWS($N$3:O14)+$B$7-1))<>\"\",CHAR(149)& \" \"&INDEX(F$3:F$52,SMALL(K$3:K$52,ROWS($N$3:O14)+$B$7-1)),\"\"),\"\")","v":""},{"$f":"IFERROR(IF(INDEX(G$3:G$52,SMALL(L$3:L$52,ROWS($N$3:P14)+$B$8-1))<>\"\",CHAR(149)& \" \"&INDEX(G$3:G$52,SMALL(L$3:L$52,ROWS($N$3:P14)+$B$8-1)),\"\"),\"\")","v":""},{"$f":"IFERROR(IF(INDEX(H$3:H$52,SMALL(M$3:M$52,ROWS($N$3:Q14)+$B$9-1))<>\"\",CHAR(149)& \" \"&INDEX(H$3:H$52,SMALL(M$3:M$52,ROWS($N$3:Q14)+$B$9-1)),\"\"),\"\")","v":""}]
["Completed",null,{"$f":"IF('To Do List '!#REF!=Sheet2!$A$15,TRUE,FALSE)","v":{"$error":"#REF!"}},null,{"$f":"IF(AND('To Do List '!C15=\"Ja\",'To Do List '!D15=\"Ja\"),'To Do List '!B15,\"\")","v":""},{"$f":"IF(AND('To Do List '!C15=\"Ja\",'To Do List '!D15=\"Nein\"),'To Do List '!B15,\"\")","v":""},{"$f":"IF(AND('To Do List '!C15=\"Nein\",'To Do List '!D15=\"Ja\"),'To Do List '!B15,\"\")","v":""},{"$f":"IF(AND('To Do List '!C15=\"Nein\",'To Do List '!D15=\"Nein\"),'To Do List '!B15,\"\")","v":""},null,{"$f":"IF(E15<>\"\",ROWS($I$3:I15),\"\")","v":""},{"$f":"IF(F15<>\"\",ROWS($I$3:J15),\"\")","v":""},{"$f":"IF(G15<>\"\",ROWS($I$3:K15),\"\")","v":""},{"$f":"IF(H15<>\"\",ROWS($I$3:L15),\"\")","v":""},null,{"$f":"IFERROR(IF(INDEX(E$3:E$52,SMALL(J$3:J$52,ROWS($N$3:N15)+$B$6-1))<>\"\",CHAR(149)& \" \"&INDEX(E$3:E$52,SMALL(J$3:J$52,ROWS($N$3:N15)+$B$6-1)),\"\"),\"\")","v":""},{"$f":"IFERROR(IF(INDEX(F$3:F$52,SMALL(K$3:K$52,ROWS($N$3:O15)+$B$7-1))<>\"\",CHAR(149)& \" \"&INDEX(F$3:F$52,SMALL(K$3:K$52,ROWS($N$3:O15)+$B$7-1)),\"\"),\"\")","v":""},{"$f":"IFERROR(IF(INDEX(G$3:G$52,SMALL(L$3:L$52,ROWS($N$3:P15)+$B$8-1))<>\"\",CHAR(149)& \" \"&INDEX(G$3:G$52,SMALL(L$3:L$52,ROWS($N$3:P15)+$B$8-1)),\"\"),\"\")","v":""},{"$f":"IFERROR(IF(INDEX(H$3:H$52,SMALL(M$3:M$52,ROWS($N$3:Q15)+$B$9-1))<>\"\",CHAR(149)& \" \"&INDEX(H$3:H$52,SMALL(M$3:M$52,ROWS($N$3:Q15)+$B$9-1)),\"\"),\"\")","v":""}]
{"$rows_left_out":47}
{"sheet":"Task Matrix","index":3,"n_rows":27,"n_cols":5,"rows_kept":27,"cut":false,"hidden":false,"merged":[]}
[]
[]
[]
[]
[null,{"$f":"Sheet2!O3","v":"• Projekt Kickoff planen"},null,null,{"$f":"Sheet2!P3","v":"• Besprechung mit XY durchführen"}]
[null,{"$f":"Sheet2!O4","v":"• Teammeeting planen"},null,null,{"$f":"Sheet2!P4","v":"• Risikomanagement durchführen"}]
[null,{"$f":"Sheet2!O5","v":""},null,null,{"$f":"Sheet2!P5","v":""}]
[null,{"$f":"Sheet2!O6","v":""},null,null,{"$f":"Sheet2!P6","v":""}]
[null,{"$f":"Sheet2!O7","v":""},null,null,{"$f":"Sheet2!P7","v":""}]
[null,{"$f":"Sheet2!O8","v":""},null,null,{"$f":"Sheet2!P8","v":""}]
[null,{"$f":"Sheet2!O9","v":""},null,null,{"$f":"Sheet2!P9","v":""}]
[null,{"$f":"Sheet2!O10","v":""},null,null,{"$f":"Sheet2!P10","v":""}]
[null,{"$f":"Sheet2!O11","v":""},null,null,{"$f":"Sheet2!P11","v":""}]
[null,{"$f":"Sheet2!O12","v":""},null,null,{"$f":"Sheet2!P12","v":""}]
[]
{"$rows_left_out":12}