{"text_format":"1","workbook":"xlsx","n_sheets":4,"sheets":["To Do List ","Sources","Sheet2","Task Matrix"],"not_rendered":{"charts":0,"images":1,"macros":1,"external_links":0,"defined_names":1,"comments":0,"pivot_tables":0},"unopened":[],"bounds":{"document_bytes":16777216,"sheet_cells":100000,"rows_first":2000,"rows_last":500,"rows_between":2000,"halvings":0,"cell_chars":16384,"cell_head_chars":4096},"cells_cut":0,"cells_raw":0,"read":"whole","date_system":"1900"}

{"sheet":"To Do List ","index":0,"n_rows":52,"n_cols":4,"rows_kept":52,"cut":false,"hidden":false,"merged":[]}
[]
[null,"Aktivitäten","Wichtig","Dringend"]
[null,"Projekt Kickoff planen","Ja","Ja"]
[null,"Abrechnung machen","Nein","Ja"]
[null,"Besprechung mit XY durchführen","Ja","Nein"]
[null,"Teammeeting planen","Ja","Ja"]
[null,"CC-Emails lesen","Nein","Nein"]
[null,"Risikomanagement durchführen","Ja","Nein"]
[]
[]
[]
[]
[]
[]
[]
[]
[]
[]
[]
[]
[]
[]
[]
[]
[]
[]
[]
[]
[]
[]
[]
[]
[]
[null,{"$f":"IFERROR(#REF!,\"\")","v":""},{"$f":"IFERROR(#REF!,\"\")","v":""},{"$f":"IFERROR(#REF!,\"\")","v":""}]
[null,{"$f":"IFERROR(#REF!,\"\")","v":""},{"$f":"IFERROR(#REF!,\"\")","v":""},{"$f":"IFERROR(#REF!,\"\")","v":""}]
[null,{"$f":"IFERROR(#REF!,\"\")","v":""},{"$f":"IFERROR(#REF!,\"\")","v":""},{"$f":"IFERROR(#REF!,\"\")","v":""}]
[null,{"$f":"IFERROR(#REF!,\"\")","v":""},{"$f":"IFERROR(#REF!,\"\")","v":""},{"$f":"IFERROR(#REF!,\"\")","v":""}]
[null,{"$f":"IFERROR(#REF!,\"\")","v":""},{"$f":"IFERROR(#REF!,\"\")","v":""},{"$f":"IFERROR(#REF!,\"\")","v":""}]
[null,{"$f":"IFERROR(#REF!,\"\")","v":""},{"$f":"IFERROR(#REF!,\"\")","v":""},{"$f":"IFERROR(#REF!,\"\")","v":""}]
[null,{"$f":"IFERROR(#REF!,\"\")","v":""},{"$f":"IFERROR(#REF!,\"\")","v":""},{"$f":"IFERROR(#REF!,\"\")","v":""}]
[null,{"$f":"IFERROR(#REF!,\"\")","v":""},{"$f":"IFERROR(#REF!,\"\")","v":""},{"$f":"IFERROR(#REF!,\"\")","v":""}]
[null,{"$f":"IFERROR(#REF!,\"\")","v":""},{"$f":"IFERROR(#REF!,\"\")","v":""},{"$f":"IFERROR(#REF!,\"\")","v":""}]
[null,{"$f":"IFERROR(#REF!,\"\")","v":""},{"$f":"IFERROR(#REF!,\"\")","v":""},{"$f":"IFERROR(#REF!,\"\")","v":""}]
[null,{"$f":"IFERROR(#REF!,\"\")","v":""},{"$f":"IFERROR(#REF!,\"\")","v":""},{"$f":"IFERROR(#REF!,\"\")","v":""}]
[null,{"$f":"IFERROR(#REF!,\"\")","v":""},{"$f":"IFERROR(#REF!,\"\")","v":""},{"$f":"IFERROR(#REF!,\"\")","v":""}]
[null,{"$f":"IFERROR(#REF!,\"\")","v":""},{"$f":"IFERROR(#REF!,\"\")","v":""},{"$f":"IFERROR(#REF!,\"\")","v":""}]
[null,{"$f":"IFERROR(#REF!,\"\")","v":""},{"$f":"IFERROR(#REF!,\"\")","v":""},{"$f":"IFERROR(#REF!,\"\")","v":""}]
[null,{"$f":"IFERROR(#REF!,\"\")","v":""},{"$f":"IFERROR(#REF!,\"\")","v":""},{"$f":"IFERROR(#REF!,\"\")","v":""}]
[null,{"$f":"IFERROR(#REF!,\"\")","v":""},{"$f":"IFERROR(#REF!,\"\")","v":""},{"$f":"IFERROR(#REF!,\"\")","v":""}]
[null,{"$f":"IFERROR(#REF!,\"\")","v":""},{"$f":"IFERROR(#REF!,\"\")","v":""},{"$f":"IFERROR(#REF!,\"\")","v":""}]
[null,{"$f":"IFERROR(#REF!,\"\")","v":""},{"$f":"IFERROR(#REF!,\"\")","v":""},{"$f":"IFERROR(#REF!,\"\")","v":""}]
[null,{"$f":"IFERROR(#REF!,\"\")","v":""},{"$f":"IFERROR(#REF!,\"\")","v":""},{"$f":"IFERROR(#REF!,\"\")","v":""}]

{"sheet":"Sources","index":1,"n_rows":0,"n_cols":0,"rows_kept":0,"cut":false,"hidden":true,"merged":[]}

{"sheet":"Sheet2","index":2,"n_rows":61,"n_cols":18,"rows_kept":61,"cut":false,"hidden":true,"merged":[]}
[]
[null,"Ja",null,null,"Important & Urgent","Important","Urgent","None",null,"Important & Urgent","Important","Urgent","None",null,"Important & Urgent","Important","Urgent","None"]
[null,"Nein",{"$f":"IF('To Do List '!#REF!=Sheet2!$A$15,TRUE,FALSE)","v":{"$error":"#REF!"}},null,{"$f":"IF(AND('To Do List '!C3=\"Ja\",'To Do List '!D3=\"Ja\"),'To Do List '!B3,\"\")","v":"Projekt Kickoff planen"},{"$f":"IF(AND('To Do List '!C3=\"Ja\",'To Do List '!D3=\"Nein\"),'To Do List '!B3,\"\")","v":""},{"$f":"IF(AND('To Do List '!C3=\"Nein\",'To Do List '!D3=\"Ja\"),'To Do List '!B3,\"\")","v":""},{"$f":"IF(AND('To Do List '!C3=\"Nein\",'To Do List '!D3=\"Nein\"),'To Do List '!B3,\"\")","v":""},null,{"$f":"IF(E3<>\"\",ROWS($I$3:I3),\"\")","v":1},{"$f":"IF(F3<>\"\",ROWS($I$3:J3),\"\")","v":""},{"$f":"IF(G3<>\"\",ROWS($I$3:K3),\"\")","v":""},{"$f":"IF(H3<>\"\",ROWS($I$3:L3),\"\")","v":""},{"$f":"INDEX($C$3:$C$52,SMALL($J$3:$J$52,ROWS($S$3:S3)+$B$6-1))","v":{"$error":"#REF!"}},{"$f":"IFERROR(IF(INDEX(E$3:E$52,SMALL(J$3:J$52,ROWS($N$3:N3)+$B$6-1))<>\"\",CHAR(149)& \" \"&INDEX(E$3:E$52,SMALL(J$3:J$52,ROWS($N$3:N3)+$B$6-1)),\"\"),\"\")","v":"• Projekt Kickoff planen"},{"$f":"IFERROR(IF(INDEX(F$3:F$52,SMALL(K$3:K$52,ROWS($N$3:O3)+$B$7-1))<>\"\",CHAR(149)& \" \"&INDEX(F$3:F$52,SMALL(K$3:K$52,ROWS($N$3:O3)+$B$7-1)),\"\"),\"\")","v":"• Besprechung mit XY durchführen"},{"$f":"IFERROR(IF(INDEX(G$3:G$52,SMALL(L$3:L$52,ROWS($N$3:P3)+$B$8-1))<>\"\",CHAR(149)& \" \"&INDEX(G$3:G$52,SMALL(L$3:L$52,ROWS($N$3:P3)+$B$8-1)),\"\"),\"\")","v":"• Abrechnung machen"},{"$f":"IFERROR(IF(INDEX(H$3:H$52,SMALL(M$3:M$52,ROWS($N$3:Q3)+$B$7-1))<>\"\",CHAR(149)& \" \"&INDEX(H$3:H$52,SMALL(M$3:M$52,ROWS($N$3:Q3)+$B$7-1)),\"\"),\"\")","v":"• CC-Emails lesen"}]
[null,null,{"$f":"IF('To Do List '!#REF!=Sheet2!$A$15,TRUE,FALSE)","v":{"$error":"#REF!"}},null,{"$f":"IF(AND('To Do List '!C4=\"Ja\",'To Do List '!D4=\"Ja\"),'To Do List '!B4,\"\")","v":""},{"$f":"IF(AND('To Do List '!C4=\"Ja\",'To Do List '!D4=\"Nein\"),'To Do List '!B4,\"\")","v":""},{"$f":"IF(AND('To Do List '!C4=\"Nein\",'To Do List '!D4=\"Ja\"),'To Do List '!B4,\"\")","v":"Abrechnung machen"},{"$f":"IF(AND('To Do List '!C4=\"Nein\",'To Do List '!D4=\"Nein\"),'To Do List '!B4,\"\")","v":""},null,{"$f":"IF(E4<>\"\",ROWS($I$3:I4),\"\")","v":""},{"$f":"IF(F4<>\"\",ROWS($I$3:J4),\"\")","v":""},{"$f":"IF(G4<>\"\",ROWS($I$3:K4),\"\")","v":2},{"$f":"IF(H4<>\"\",ROWS($I$3:L4),\"\")","v":""},{"$f":"INDEX($C$3:$C$52,SMALL($J$3:$J$52,ROWS($S$3:S4)+$B$6-1))","v":{"$error":"#REF!"}},{"$f":"IFERROR(IF(INDEX(E$3:E$52,SMALL(J$3:J$52,ROWS($N$3:N4)+$B$6-1))<>\"\",CHAR(149)& \" \"&INDEX(E$3:E$52,SMALL(J$3:J$52,ROWS($N$3:N4)+$B$6-1)),\"\"),\"\")","v":"• Teammeeting planen"},{"$f":"IFERROR(IF(INDEX(F$3:F$52,SMALL(K$3:K$52,ROWS($N$3:O4)+$B$7-1))<>\"\",CHAR(149)& \" \"&INDEX(F$3:F$52,SMALL(K$3:K$52,ROWS($N$3:O4)+$B$7-1)),\"\"),\"\")","v":"• Risikomanagement durchführen"},{"$f":"IFERROR(IF(INDEX(G$3:G$52,SMALL(L$3:L$52,ROWS($N$3:P4)+$B$8-1))<>\"\",CHAR(149)& \" \"&INDEX(G$3:G$52,SMALL(L$3:L$52,ROWS($N$3:P4)+$B$8-1)),\"\"),\"\")","v":""},{"$f":"IFERROR(IF(INDEX(H$3:H$52,SMALL(M$3:M$52,ROWS($N$3:Q4)+$B$9-1))<>\"\",CHAR(149)& \" \"&INDEX(H$3:H$52,SMALL(M$3:M$52,ROWS($N$3:Q4)+$B$9-1)),\"\"),\"\")","v":""}]
[null,null,{"$f":"IF('To Do List '!#REF!=Sheet2!$A$15,TRUE,FALSE)","v":{"$error":"#REF!"}},null,{"$f":"IF(AND('To Do List '!C5=\"Ja\",'To Do List '!D5=\"Ja\"),'To Do List '!B5,\"\")","v":""},{"$f":"IF(AND('To Do List '!C5=\"Ja\",'To Do List '!D5=\"Nein\"),'To Do List '!B5,\"\")","v":"Besprechung mit XY durchführen"},{"$f":"IF(AND('To Do List '!C5=\"Nein\",'To Do List '!D5=\"Ja\"),'To Do List '!B5,\"\")","v":""},{"$f":"IF(AND('To Do List '!C5=\"Nein\",'To Do List '!D5=\"Nein\"),'To Do List '!B5,\"\")","v":""},null,{"$f":"IF(E5<>\"\",ROWS($I$3:I5),\"\")","v":""},{"$f":"IF(F5<>\"\",ROWS($I$3:J5),\"\")","v":3},{"$f":"IF(G5<>\"\",ROWS($I$3:K5),\"\")","v":""},{"$f":"IF(H5<>\"\",ROWS($I$3:L5),\"\")","v":""},{"$f":"INDEX($C$3:$C$52,SMALL($J$3:$J$52,ROWS($S$3:S5)+$B$6-1))","v":{"$error":"#NUM!"}},{"$f":"IFERROR(IF(INDEX(E$3:E$52,SMALL(J$3:J$52,ROWS($N$3:N5)+$B$6-1))<>\"\",CHAR(149)& \" \"&INDEX(E$3:E$52,SMALL(J$3:J$52,ROWS($N$3:N5)+$B$6-1)),\"\"),\"\")","v":""},{"$f":"IFERROR(IF(INDEX(F$3:F$52,SMALL(K$3:K$52,ROWS($N$3:O5)+$B$7-1))<>\"\",CHAR(149)& \" \"&INDEX(F$3:F$52,SMALL(K$3:K$52,ROWS($N$3:O5)+$B$7-1)),\"\"),\"\")","v":""},{"$f":"IFERROR(IF(INDEX(G$3:G$52,SMALL(L$3:L$52,ROWS($N$3:P5)+$B$8-1))<>\"\",CHAR(149)& \" \"&INDEX(G$3:G$52,SMALL(L$3:L$52,ROWS($N$3:P5)+$B$8-1)),\"\"),\"\")","v":""},{"$f":"IFERROR(IF(INDEX(H$3:H$52,SMALL(M$3:M$52,ROWS($N$3:Q5)+$B$9-1))<>\"\",CHAR(149)& \" \"&INDEX(H$3:H$52,SMALL(M$3:M$52,ROWS($N$3:Q5)+$B$9-1)),\"\"),\"\")","v":""}]
["Scroll Bar - Imp and Urgent",1,{"$f":"IF('To Do List '!#REF!=Sheet2!$A$15,TRUE,FALSE)","v":{"$error":"#REF!"}},null,{"$f":"IF(AND('To Do List '!C6=\"Ja\",'To Do List '!D6=\"Ja\"),'To Do List '!B6,\"\")","v":"Teammeeting planen"},{"$f":"IF(AND('To Do List '!C6=\"Ja\",'To Do List '!D6=\"Nein\"),'To Do List '!B6,\"\")","v":""},{"$f":"IF(AND('To Do List '!C6=\"Nein\",'To Do List '!D6=\"Ja\"),'To Do List '!B6,\"\")","v":""},{"$f":"IF(AND('To Do List '!C6=\"Nein\",'To Do List '!D6=\"Nein\"),'To Do List '!B6,\"\")","v":""},null,{"$f":"IF(E6<>\"\",ROWS($I$3:I6),\"\")","v":4},{"$f":"IF(F6<>\"\",ROWS($I$3:J6),\"\")","v":""},{"$f":"IF(G6<>\"\",ROWS($I$3:K6),\"\")","v":""},{"$f":"IF(H6<>\"\",ROWS($I$3:L6),\"\")","v":""},{"$f":"INDEX($C$3:$C$52,SMALL($J$3:$J$52,ROWS($S$3:S6)+$B$6-1))","v":{"$error":"#NUM!"}},{"$f":"IFERROR(IF(INDEX(E$3:E$52,SMALL(J$3:J$52,ROWS($N$3:N6)+$B$6-1))<>\"\",CHAR(149)& \" \"&INDEX(E$3:E$52,SMALL(J$3:J$52,ROWS($N$3:N6)+$B$6-1)),\"\"),\"\")","v":""},{"$f":"IFERROR(IF(INDEX(F$3:F$52,SMALL(K$3:K$52,ROWS($N$3:O6)+$B$7-1))<>\"\",CHAR(149)& \" \"&INDEX(F$3:F$52,SMALL(K$3:K$52,ROWS($N$3:O6)+$B$7-1)),\"\"),\"\")","v":""},{"$f":"IFERROR(IF(INDEX(G$3:G$52,SMALL(L$3:L$52,ROWS($N$3:P6)+$B$8-1))<>\"\",CHAR(149)& \" \"&INDEX(G$3:G$52,SMALL(L$3:L$52,ROWS($N$3:P6)+$B$8-1)),\"\"),\"\")","v":""},{"$f":"IFERROR(IF(INDEX(H$3:H$52,SMALL(M$3:M$52,ROWS($N$3:Q6)+$B$9-1))<>\"\",CHAR(149)& \" \"&INDEX(H$3:H$52,SMALL(M$3:M$52,ROWS($N$3:Q6)+$B$9-1)),\"\"),\"\")","v":""}]
[null,1,{"$f":"IF('To Do List '!#REF!=Sheet2!$A$15,TRUE,FALSE)","v":{"$error":"#REF!"}},null,{"$f":"IF(AND('To Do List '!C7=\"Ja\",'To Do List '!D7=\"Ja\"),'To Do List '!B7,\"\")","v":""},{"$f":"IF(AND('To Do List '!C7=\"Ja\",'To Do List '!D7=\"Nein\"),'To Do List '!B7,\"\")","v":""},{"$f":"IF(AND('To Do List '!C7=\"Nein\",'To Do List '!D7=\"Ja\"),'To Do List '!B7,\"\")","v":""},{"$f":"IF(AND('To Do List '!C7=\"Nein\",'To Do List '!D7=\"Nein\"),'To Do List '!B7,\"\")","v":"CC-Emails lesen"},null,{"$f":"IF(E7<>\"\",ROWS($I$3:I7),\"\")","v":""},{"$f":"IF(F7<>\"\",ROWS($I$3:J7),\"\")","v":""},{"$f":"IF(G7<>\"\",ROWS($I$3:K7),\"\")","v":""},{"$f":"IF(H7<>\"\",ROWS($I$3:L7),\"\")","v":5},{"$f":"INDEX($C$3:$C$52,SMALL($J$3:$J$52,ROWS($S$3:S7)+$B$6-1))","v":{"$error":"#NUM!"}},{"$f":"IFERROR(IF(INDEX(E$3:E$52,SMALL(J$3:J$52,ROWS($N$3:N7)+$B$6-1))<>\"\",CHAR(149)& \" \"&INDEX(E$3:E$52,SMALL(J$3:J$52,ROWS($N$3:N7)+$B$6-1)),\"\"),\"\")","v":""},{"$f":"IFERROR(IF(INDEX(F$3:F$52,SMALL(K$3:K$52,ROWS($N$3:O7)+$B$7-1))<>\"\",CHAR(149)& \" \"&INDEX(F$3:F$52,SMALL(K$3:K$52,ROWS($N$3:O7)+$B$7-1)),\"\"),\"\")","v":""},{"$f":"IFERROR(IF(INDEX(G$3:G$52,SMALL(L$3:L$52,ROWS($N$3:P7)+$B$8-1))<>\"\",CHAR(149)& \" \"&INDEX(G$3:G$52,SMALL(L$3:L$52,ROWS($N$3:P7)+$B$8-1)),\"\"),\"\")","v":""},{"$f":"IFERROR(IF(INDEX(H$3:H$52,SMALL(M$3:M$52,ROWS($N$3:Q7)+$B$9-1))<>\"\",CHAR(149)& \" \"&INDEX(H$3:H$52,SMALL(M$3:M$52,ROWS($N$3:Q7)+$B$9-1)),\"\"),\"\")","v":""}]
[null,1,{"$f":"IF('To Do List '!#REF!=Sheet2!$A$15,TRUE,FALSE)","v":{"$error":"#REF!"}},null,{"$f":"IF(AND('To Do List '!C8=\"Ja\",'To Do List '!D8=\"Ja\"),'To Do List '!B8,\"\")","v":""},{"$f":"IF(AND('To Do List '!C8=\"Ja\",'To Do List '!D8=\"Nein\"),'To Do List '!B8,\"\")","v":"Risikomanagement durchführen"},{"$f":"IF(AND('To Do List '!C8=\"Nein\",'To Do List '!D8=\"Ja\"),'To Do List '!B8,\"\")","v":""},{"$f":"IF(AND('To Do List '!C8=\"Nein\",'To Do List '!D8=\"Nein\"),'To Do List '!B8,\"\")","v":""},null,{"$f":"IF(E8<>\"\",ROWS($I$3:I8),\"\")","v":""},{"$f":"IF(F8<>\"\",ROWS($I$3:J8),\"\")","v":6},{"$f":"IF(G8<>\"\",ROWS($I$3:K8),\"\")","v":""},{"$f":"IF(H8<>\"\",ROWS($I$3:L8),\"\")","v":""},{"$f":"INDEX($C$3:$C$52,SMALL($J$3:$J$52,ROWS($S$3:S8)+$B$6-1))","v":{"$error":"#NUM!"}},{"$f":"IFERROR(IF(INDEX(E$3:E$52,SMALL(J$3:J$52,ROWS($N$3:N8)+$B$6-1))<>\"\",CHAR(149)& \" \"&INDEX(E$3:E$52,SMALL(J$3:J$52,ROWS($N$3:N8)+$B$6-1)),\"\"),\"\")","v":""},{"$f":"IFERROR(IF(INDEX(F$3:F$52,SMALL(K$3:K$52,ROWS($N$3:O8)+$B$7-1))<>\"\",CHAR(149)& \" \"&INDEX(F$3:F$52,SMALL(K$3:K$52,ROWS($N$3:O8)+$B$7-1)),\"\"),\"\")","v":""},{"$f":"IFERROR(IF(INDEX(G$3:G$52,SMALL(L$3:L$52,ROWS($N$3:P8)+$B$8-1))<>\"\",CHAR(149)& \" \"&INDEX(G$3:G$52,SMALL(L$3:L$52,ROWS($N$3:P8)+$B$8-1)),\"\"),\"\")","v":""},{"$f":"IFERROR(IF(INDEX(H$3:H$52,SMALL(M$3:M$52,ROWS($N$3:Q8)+$B$9-1))<>\"\",CHAR(149)& \" \"&INDEX(H$3:H$52,SMALL(M$3:M$52,ROWS($N$3:Q8)+$B$9-1)),\"\"),\"\")","v":""}]
[null,1,{"$f":"IF('To Do List '!#REF!=Sheet2!$A$15,TRUE,FALSE)","v":{"$error":"#REF!"}},null,{"$f":"IF(AND('To Do List '!C9=\"Ja\",'To Do List '!D9=\"Ja\"),'To Do List '!B9,\"\")","v":""},{"$f":"IF(AND('To Do List '!C9=\"Ja\",'To Do List '!D9=\"Nein\"),'To Do List '!B9,\"\")","v":""},{"$f":"IF(AND('To Do List '!C9=\"Nein\",'To Do List '!D9=\"Ja\"),'To Do List '!B9,\"\")","v":""},{"$f":"IF(AND('To Do List '!C9=\"Nein\",'To Do List '!D9=\"Nein\"),'To Do List '!B9,\"\")","v":""},null,{"$f":"IF(E9<>\"\",ROWS($I$3:I9),\"\")","v":""},{"$f":"IF(F9<>\"\",ROWS($I$3:J9),\"\")","v":""},{"$f":"IF(G9<>\"\",ROWS($I$3:K9),\"\")","v":""},{"$f":"IF(H9<>\"\",ROWS($I$3:L9),\"\")","v":""},{"$f":"INDEX($C$3:$C$52,SMALL($J$3:$J$52,ROWS($S$3:S9)+$B$6-1))","v":{"$error":"#NUM!"}},{"$f":"IFERROR(IF(INDEX(E$3:E$52,SMALL(J$3:J$52,ROWS($N$3:N9)+$B$6-1))<>\"\",CHAR(149)& \" \"&INDEX(E$3:E$52,SMALL(J$3:J$52,ROWS($N$3:N9)+$B$6-1)),\"\"),\"\")","v":""},{"$f":"IFERROR(IF(INDEX(F$3:F$52,SMALL(K$3:K$52,ROWS($N$3:O9)+$B$7-1))<>\"\",CHAR(149)& \" \"&INDEX(F$3:F$52,SMALL(K$3:K$52,ROWS($N$3:O9)+$B$7-1)),\"\"),\"\")","v":""},{"$f":"IFERROR(IF(INDEX(G$3:G$52,SMALL(L$3:L$52,ROWS($N$3:P9)+$B$8-1))<>\"\",CHAR(149)& \" \"&INDEX(G$3:G$52,SMALL(L$3:L$52,ROWS($N$3:P9)+$B$8-1)),\"\"),\"\")","v":""},{"$f":"IFERROR(IF(INDEX(H$3:H$52,SMALL(M$3:M$52,ROWS($N$3:Q9)+$B$9-1))<>\"\",CHAR(149)& \" \"&INDEX(H$3:H$52,SMALL(M$3:M$52,ROWS($N$3:Q9)+$B$9-1)),\"\"),\"\")","v":""}]
[null,null,{"$f":"IF('To Do List '!#REF!=Sheet2!$A$15,TRUE,FALSE)","v":{"$error":"#REF!"}},null,{"$f":"IF(AND('To Do List '!C10=\"Ja\",'To Do List '!D10=\"Ja\"),'To Do List '!B10,\"\")","v":""},{"$f":"IF(AND('To Do List '!C10=\"Ja\",'To Do List '!D10=\"Nein\"),'To Do List '!B10,\"\")","v":""},{"$f":"IF(AND('To Do List '!C10=\"Nein\",'To Do List '!D10=\"Ja\"),'To Do List '!B10,\"\")","v":""},{"$f":"IF(AND('To Do List '!C10=\"Nein\",'To Do List '!D10=\"Nein\"),'To Do List '!B10,\"\")","v":""},null,{"$f":"IF(E10<>\"\",ROWS($I$3:I10),\"\")","v":""},{"$f":"IF(F10<>\"\",ROWS($I$3:J10),\"\")","v":""},{"$f":"IF(G10<>\"\",ROWS($I$3:K10),\"\")","v":""},{"$f":"IF(H10<>\"\",ROWS($I$3:L10),\"\")","v":""},{"$f":"INDEX($C$3:$C$52,SMALL($J$3:$J$52,ROWS($S$3:S10)+$B$6-1))","v":{"$error":"#NUM!"}},{"$f":"IFERROR(IF(INDEX(E$3:E$52,SMALL(J$3:J$52,ROWS($N$3:N10)+$B$6-1))<>\"\",CHAR(149)& \" \"&INDEX(E$3:E$52,SMALL(J$3:J$52,ROWS($N$3:N10)+$B$6-1)),\"\"),\"\")","v":""},{"$f":"IFERROR(IF(INDEX(F$3:F$52,SMALL(K$3:K$52,ROWS($N$3:O10)+$B$7-1))<>\"\",CHAR(149)& \" \"&INDEX(F$3:F$52,SMALL(K$3:K$52,ROWS($N$3:O10)+$B$7-1)),\"\"),\"\")","v":""},{"$f":"IFERROR(IF(INDEX(G$3:G$52,SMALL(L$3:L$52,ROWS($N$3:P10)+$B$8-1))<>\"\",CHAR(149)& \" \"&INDEX(G$3:G$52,SMALL(L$3:L$52,ROWS($N$3:P10)+$B$8-1)),\"\"),\"\")","v":""},{"$f":"IFERROR(IF(INDEX(H$3:H$52,SMALL(M$3:M$52,ROWS($N$3:Q10)+$B$9-1))<>\"\",CHAR(149)& \" \"&INDEX(H$3:H$52,SMALL(M$3:M$52,ROWS($N$3:Q10)+$B$9-1)),\"\"),\"\")","v":""}]
[null,null,{"$f":"IF('To Do List '!#REF!=Sheet2!$A$15,TRUE,FALSE)","v":{"$error":"#REF!"}},null,{"$f":"IF(AND('To Do List '!C11=\"Ja\",'To Do List '!D11=\"Ja\"),'To Do List '!B11,\"\")","v":""},{"$f":"IF(AND('To Do List '!C11=\"Ja\",'To Do List '!D11=\"Nein\"),'To Do List '!B11,\"\")","v":""},{"$f":"IF(AND('To Do List '!C11=\"Nein\",'To Do List '!D11=\"Ja\"),'To Do List '!B11,\"\")","v":""},{"$f":"IF(AND('To Do List '!C11=\"Nein\",'To Do List '!D11=\"Nein\"),'To Do List '!B11,\"\")","v":""},null,{"$f":"IF(E11<>\"\",ROWS($I$3:I11),\"\")","v":""},{"$f":"IF(F11<>\"\",ROWS($I$3:J11),\"\")","v":""},{"$f":"IF(G11<>\"\",ROWS($I$3:K11),\"\")","v":""},{"$f":"IF(H11<>\"\",ROWS($I$3:L11),\"\")","v":""},null,{"$f":"IFERROR(IF(INDEX(E$3:E$52,SMALL(J$3:J$52,ROWS($N$3:N11)+$B$6-1))<>\"\",CHAR(149)& \" \"&INDEX(E$3:E$52,SMALL(J$3:J$52,ROWS($N$3:N11)+$B$6-1)),\"\"),\"\")","v":""},{"$f":"IFERROR(IF(INDEX(F$3:F$52,SMALL(K$3:K$52,ROWS($N$3:O11)+$B$7-1))<>\"\",CHAR(149)& \" \"&INDEX(F$3:F$52,SMALL(K$3:K$52,ROWS($N$3:O11)+$B$7-1)),\"\"),\"\")","v":""},{"$f":"IFERROR(IF(INDEX(G$3:G$52,SMALL(L$3:L$52,ROWS($N$3:P11)+$B$8-1))<>\"\",CHAR(149)& \" \"&INDEX(G$3:G$52,SMALL(L$3:L$52,ROWS($N$3:P11)+$B$8-1)),\"\"),\"\")","v":""},{"$f":"IFERROR(IF(INDEX(H$3:H$52,SMALL(M$3:M$52,ROWS($N$3:Q11)+$B$9-1))<>\"\",CHAR(149)& \" \"&INDEX(H$3:H$52,SMALL(M$3:M$52,ROWS($N$3:Q11)+$B$9-1)),\"\"),\"\")","v":""}]
["Status Options",null,{"$f":"IF('To Do List '!#REF!=Sheet2!$A$15,TRUE,FALSE)","v":{"$error":"#REF!"}},null,{"$f":"IF(AND('To Do List '!C12=\"Ja\",'To Do List '!D12=\"Ja\"),'To Do List '!B12,\"\")","v":""},{"$f":"IF(AND('To Do List '!C12=\"Ja\",'To Do List '!D12=\"Nein\"),'To Do List '!B12,\"\")","v":""},{"$f":"IF(AND('To Do List '!C12=\"Nein\",'To Do List '!D12=\"Ja\"),'To Do List '!B12,\"\")","v":""},{"$f":"IF(AND('To Do List '!C12=\"Nein\",'To Do List '!D12=\"Nein\"),'To Do List '!B12,\"\")","v":""},null,{"$f":"IF(E12<>\"\",ROWS($I$3:I12),\"\")","v":""},{"$f":"IF(F12<>\"\",ROWS($I$3:J12),\"\")","v":""},{"$f":"IF(G12<>\"\",ROWS($I$3:K12),\"\")","v":""},{"$f":"IF(H12<>\"\",ROWS($I$3:L12),\"\")","v":""},null,{"$f":"IFERROR(IF(INDEX(E$3:E$52,SMALL(J$3:J$52,ROWS($N$3:N12)+$B$6-1))<>\"\",CHAR(149)& \" \"&INDEX(E$3:E$52,SMALL(J$3:J$52,ROWS($N$3:N12)+$B$6-1)),\"\"),\"\")","v":""},{"$f":"IFERROR(IF(INDEX(F$3:F$52,SMALL(K$3:K$52,ROWS($N$3:O12)+$B$7-1))<>\"\",CHAR(149)& \" \"&INDEX(F$3:F$52,SMALL(K$3:K$52,ROWS($N$3:O12)+$B$7-1)),\"\"),\"\")","v":""},{"$f":"IFERROR(IF(INDEX(G$3:G$52,SMALL(L$3:L$52,ROWS($N$3:P12)+$B$8-1))<>\"\",CHAR(149)& \" \"&INDEX(G$3:G$52,SMALL(L$3:L$52,ROWS($N$3:P12)+$B$8-1)),\"\"),\"\")","v":""},{"$f":"IFERROR(IF(INDEX(H$3:H$52,SMALL(M$3:M$52,ROWS($N$3:Q12)+$B$9-1))<>\"\",CHAR(149)& \" \"&INDEX(H$3:H$52,SMALL(M$3:M$52,ROWS($N$3:Q12)+$B$9-1)),\"\"),\"\")","v":""}]
["To be Started",null,{"$f":"IF('To Do List '!#REF!=Sheet2!$A$15,TRUE,FALSE)","v":{"$error":"#REF!"}},null,{"$f":"IF(AND('To Do List '!C13=\"Ja\",'To Do List '!D13=\"Ja\"),'To Do List '!B13,\"\")","v":""},{"$f":"IF(AND('To Do List '!C13=\"Ja\",'To Do List '!D13=\"Nein\"),'To Do List '!B13,\"\")","v":""},{"$f":"IF(AND('To Do List '!C13=\"Nein\",'To Do List '!D13=\"Ja\"),'To Do List '!B13,\"\")","v":""},{"$f":"IF(AND('To Do List '!C13=\"Nein\",'To Do List '!D13=\"Nein\"),'To Do List '!B13,\"\")","v":""},null,{"$f":"IF(E13<>\"\",ROWS($I$3:I13),\"\")","v":""},{"$f":"IF(F13<>\"\",ROWS($I$3:J13),\"\")","v":""},{"$f":"IF(G13<>\"\",ROWS($I$3:K13),\"\")","v":""},{"$f":"IF(H13<>\"\",ROWS($I$3:L13),\"\")","v":""},null,{"$f":"IFERROR(IF(INDEX(E$3:E$52,SMALL(J$3:J$52,ROWS($N$3:N13)+$B$6-1))<>\"\",CHAR(149)& \" \"&INDEX(E$3:E$52,SMALL(J$3:J$52,ROWS($N$3:N13)+$B$6-1)),\"\"),\"\")","v":""},{"$f":"IFERROR(IF(INDEX(F$3:F$52,SMALL(K$3:K$52,ROWS($N$3:O13)+$B$7-1))<>\"\",CHAR(149)& \" \"&INDEX(F$3:F$52,SMALL(K$3:K$52,ROWS($N$3:O13)+$B$7-1)),\"\"),\"\")","v":""},{"$f":"IFERROR(IF(INDEX(G$3:G$52,SMALL(L$3:L$52,ROWS($N$3:P13)+$B$8-1))<>\"\",CHAR(149)& \" \"&INDEX(G$3:G$52,SMALL(L$3:L$52,ROWS($N$3:P13)+$B$8-1)),\"\"),\"\")","v":""},{"$f":"IFERROR(IF(INDEX(H$3:H$52,SMALL(M$3:M$52,ROWS($N$3:Q13)+$B$9-1))<>\"\",CHAR(149)& \" \"&INDEX(H$3:H$52,SMALL(M$3:M$52,ROWS($N$3:Q13)+$B$9-1)),\"\"),\"\")","v":""}]
["In-Progress",null,{"$f":"IF('To Do List '!#REF!=Sheet2!$A$15,TRUE,FALSE)","v":{"$error":"#REF!"}},null,{"$f":"IF(AND('To Do List '!C14=\"Ja\",'To Do List '!D14=\"Ja\"),'To Do List '!B14,\"\")","v":""},{"$f":"IF(AND('To Do List '!C14=\"Ja\",'To Do List '!D14=\"Nein\"),'To Do List '!B14,\"\")","v":""},{"$f":"IF(AND('To Do List '!C14=\"Nein\",'To Do List '!D14=\"Ja\"),'To Do List '!B14,\"\")","v":""},{"$f":"IF(AND('To Do List '!C14=\"Nein\",'To Do List '!D14=\"Nein\"),'To Do List '!B14,\"\")","v":""},null,{"$f":"IF(E14<>\"\",ROWS($I$3:I14),\"\")","v":""},{"$f":"IF(F14<>\"\",ROWS($I$3:J14),\"\")","v":""},{"$f":"IF(G14<>\"\",ROWS($I$3:K14),\"\")","v":""},{"$f":"IF(H14<>\"\",ROWS($I$3:L14),\"\")","v":""},null,{"$f":"IFERROR(IF(INDEX(E$3:E$52,SMALL(J$3:J$52,ROWS($N$3:N14)+$B$6-1))<>\"\",CHAR(149)& \" \"&INDEX(E$3:E$52,SMALL(J$3:J$52,ROWS($N$3:N14)+$B$6-1)),\"\"),\"\")","v":""},{"$f":"IFERROR(IF(INDEX(F$3:F$52,SMALL(K$3:K$52,ROWS($N$3:O14)+$B$7-1))<>\"\",CHAR(149)& \" \"&INDEX(F$3:F$52,SMALL(K$3:K$52,ROWS($N$3:O14)+$B$7-1)),\"\"),\"\")","v":""},{"$f":"IFERROR(IF(INDEX(G$3:G$52,SMALL(L$3:L$52,ROWS($N$3:P14)+$B$8-1))<>\"\",CHAR(149)& \" \"&INDEX(G$3:G$52,SMALL(L$3:L$52,ROWS($N$3:P14)+$B$8-1)),\"\"),\"\")","v":""},{"$f":"IFERROR(IF(INDEX(H$3:H$52,SMALL(M$3:M$52,ROWS($N$3:Q14)+$B$9-1))<>\"\",CHAR(149)& \" \"&INDEX(H$3:H$52,SMALL(M$3:M$52,ROWS($N$3:Q14)+$B$9-1)),\"\"),\"\")","v":""}]
["Completed",null,{"$f":"IF('To Do List '!#REF!=Sheet2!$A$15,TRUE,FALSE)","v":{"$error":"#REF!"}},null,{"$f":"IF(AND('To Do List '!C15=\"Ja\",'To Do List '!D15=\"Ja\"),'To Do List '!B15,\"\")","v":""},{"$f":"IF(AND('To Do List '!C15=\"Ja\",'To Do List '!D15=\"Nein\"),'To Do List '!B15,\"\")","v":""},{"$f":"IF(AND('To Do List '!C15=\"Nein\",'To Do List '!D15=\"Ja\"),'To Do List '!B15,\"\")","v":""},{"$f":"IF(AND('To Do List '!C15=\"Nein\",'To Do List '!D15=\"Nein\"),'To Do List '!B15,\"\")","v":""},null,{"$f":"IF(E15<>\"\",ROWS($I$3:I15),\"\")","v":""},{"$f":"IF(F15<>\"\",ROWS($I$3:J15),\"\")","v":""},{"$f":"IF(G15<>\"\",ROWS($I$3:K15),\"\")","v":""},{"$f":"IF(H15<>\"\",ROWS($I$3:L15),\"\")","v":""},null,{"$f":"IFERROR(IF(INDEX(E$3:E$52,SMALL(J$3:J$52,ROWS($N$3:N15)+$B$6-1))<>\"\",CHAR(149)& \" \"&INDEX(E$3:E$52,SMALL(J$3:J$52,ROWS($N$3:N15)+$B$6-1)),\"\"),\"\")","v":""},{"$f":"IFERROR(IF(INDEX(F$3:F$52,SMALL(K$3:K$52,ROWS($N$3:O15)+$B$7-1))<>\"\",CHAR(149)& \" \"&INDEX(F$3:F$52,SMALL(K$3:K$52,ROWS($N$3:O15)+$B$7-1)),\"\"),\"\")","v":""},{"$f":"IFERROR(IF(INDEX(G$3:G$52,SMALL(L$3:L$52,ROWS($N$3:P15)+$B$8-1))<>\"\",CHAR(149)& \" \"&INDEX(G$3:G$52,SMALL(L$3:L$52,ROWS($N$3:P15)+$B$8-1)),\"\"),\"\")","v":""},{"$f":"IFERROR(IF(INDEX(H$3:H$52,SMALL(M$3:M$52,ROWS($N$3:Q15)+$B$9-1))<>\"\",CHAR(149)& \" \"&INDEX(H$3:H$52,SMALL(M$3:M$52,ROWS($N$3:Q15)+$B$9-1)),\"\"),\"\")","v":""}]
[null,null,{"$f":"IF('To Do List '!#REF!=Sheet2!$A$15,TRUE,FALSE)","v":{"$error":"#REF!"}},null,{"$f":"IF(AND('To Do List '!C16=\"Ja\",'To Do List '!D16=\"Ja\"),'To Do List '!B16,\"\")","v":""},{"$f":"IF(AND('To Do List '!C16=\"Ja\",'To Do List '!D16=\"Nein\"),'To Do List '!B16,\"\")","v":""},{"$f":"IF(AND('To Do List '!C16=\"Nein\",'To Do List '!D16=\"Ja\"),'To Do List '!B16,\"\")","v":""},{"$f":"IF(AND('To Do List '!C16=\"Nein\",'To Do List '!D16=\"Nein\"),'To Do List '!B16,\"\")","v":""},null,{"$f":"IF(E16<>\"\",ROWS($I$3:I16),\"\")","v":""},{"$f":"IF(F16<>\"\",ROWS($I$3:J16),\"\")","v":""},{"$f":"IF(G16<>\"\",ROWS($I$3:K16),\"\")","v":""},{"$f":"IF(H16<>\"\",ROWS($I$3:L16),\"\")","v":""},null,{"$f":"IFERROR(IF(INDEX(E$3:E$52,SMALL(J$3:J$52,ROWS($N$3:N16)+$B$6-1))<>\"\",CHAR(149)& \" \"&INDEX(E$3:E$52,SMALL(J$3:J$52,ROWS($N$3:N16)+$B$6-1)),\"\"),\"\")","v":""},{"$f":"IFERROR(IF(INDEX(F$3:F$52,SMALL(K$3:K$52,ROWS($N$3:O16)+$B$7-1))<>\"\",CHAR(149)& \" \"&INDEX(F$3:F$52,SMALL(K$3:K$52,ROWS($N$3:O16)+$B$7-1)),\"\"),\"\")","v":""},{"$f":"IFERROR(IF(INDEX(G$3:G$52,SMALL(L$3:L$52,ROWS($N$3:P16)+$B$8-1))<>\"\",CHAR(149)& \" \"&INDEX(G$3:G$52,SMALL(L$3:L$52,ROWS($N$3:P16)+$B$8-1)),\"\"),\"\")","v":""},{"$f":"IFERROR(IF(INDEX(H$3:H$52,SMALL(M$3:M$52,ROWS($N$3:Q16)+$B$9-1))<>\"\",CHAR(149)& \" \"&INDEX(H$3:H$52,SMALL(M$3:M$52,ROWS($N$3:Q16)+$B$9-1)),\"\"),\"\")","v":""}]
[null,null,{"$f":"IF('To Do List '!#REF!=Sheet2!$A$15,TRUE,FALSE)","v":{"$error":"#REF!"}},null,{"$f":"IF(AND('To Do List '!C17=\"Ja\",'To Do List '!D17=\"Ja\"),'To Do List '!B17,\"\")","v":""},{"$f":"IF(AND('To Do List '!C17=\"Ja\",'To Do List '!D17=\"Nein\"),'To Do List '!B17,\"\")","v":""},{"$f":"IF(AND('To Do List '!C17=\"Nein\",'To Do List '!D17=\"Ja\"),'To Do List '!B17,\"\")","v":""},{"$f":"IF(AND('To Do List '!C17=\"Nein\",'To Do List '!D17=\"Nein\"),'To Do List '!B17,\"\")","v":""},null,{"$f":"IF(E17<>\"\",ROWS($I$3:I17),\"\")","v":""},{"$f":"IF(F17<>\"\",ROWS($I$3:J17),\"\")","v":""},{"$f":"IF(G17<>\"\",ROWS($I$3:K17),\"\")","v":""},{"$f":"IF(H17<>\"\",ROWS($I$3:L17),\"\")","v":""},null,{"$f":"IFERROR(IF(INDEX(E$3:E$52,SMALL(J$3:J$52,ROWS($N$3:N17)+$B$6-1))<>\"\",CHAR(149)& \" \"&INDEX(E$3:E$52,SMALL(J$3:J$52,ROWS($N$3:N17)+$B$6-1)),\"\"),\"\")","v":""},{"$f":"IFERROR(IF(INDEX(F$3:F$52,SMALL(K$3:K$52,ROWS($N$3:O17)+$B$7-1))<>\"\",CHAR(149)& \" \"&INDEX(F$3:F$52,SMALL(K$3:K$52,ROWS($N$3:O17)+$B$7-1)),\"\"),\"\")","v":""},{"$f":"IFERROR(IF(INDEX(G$3:G$52,SMALL(L$3:L$52,ROWS($N$3:P17)+$B$8-1))<>\"\",CHAR(149)& \" \"&INDEX(G$3:G$52,SMALL(L$3:L$52,ROWS($N$3:P17)+$B$8-1)),\"\"),\"\")","v":""},{"$f":"IFERROR(IF(INDEX(H$3:H$52,SMALL(M$3:M$52,ROWS($N$3:Q17)+$B$9-1))<>\"\",CHAR(149)& \" \"&INDEX(H$3:H$52,SMALL(M$3:M$52,ROWS($N$3:Q17)+$B$9-1)),\"\"),\"\")","v":""}]
["Ja",null,{"$f":"IF('To Do List '!#REF!=Sheet2!$A$15,TRUE,FALSE)","v":{"$error":"#REF!"}},null,{"$f":"IF(AND('To Do List '!C18=\"Ja\",'To Do List '!D18=\"Ja\"),'To Do List '!B18,\"\")","v":""},{"$f":"IF(AND('To Do List '!C18=\"Ja\",'To Do List '!D18=\"Nein\"),'To Do List '!B18,\"\")","v":""},{"$f":"IF(AND('To Do List '!C18=\"Nein\",'To Do List '!D18=\"Ja\"),'To Do List '!B18,\"\")","v":""},{"$f":"IF(AND('To Do List '!C18=\"Nein\",'To Do List '!D18=\"Nein\"),'To Do List '!B18,\"\")","v":""},null,{"$f":"IF(E18<>\"\",ROWS($I$3:I18),\"\")","v":""},{"$f":"IF(F18<>\"\",ROWS($I$3:J18),\"\")","v":""},{"$f":"IF(G18<>\"\",ROWS($I$3:K18),\"\")","v":""},{"$f":"IF(H18<>\"\",ROWS($I$3:L18),\"\")","v":""},null,{"$f":"IFERROR(IF(INDEX(E$3:E$52,SMALL(J$3:J$52,ROWS($N$3:N18)+$B$6-1))<>\"\",CHAR(149)& \" \"&INDEX(E$3:E$52,SMALL(J$3:J$52,ROWS($N$3:N18)+$B$6-1)),\"\"),\"\")","v":""},{"$f":"IFERROR(IF(INDEX(F$3:F$52,SMALL(K$3:K$52,ROWS($N$3:O18)+$B$7-1))<>\"\",CHAR(149)& \" \"&INDEX(F$3:F$52,SMALL(K$3:K$52,ROWS($N$3:O18)+$B$7-1)),\"\"),\"\")","v":""},{"$f":"IFERROR(IF(INDEX(G$3:G$52,SMALL(L$3:L$52,ROWS($N$3:P18)+$B$8-1))<>\"\",CHAR(149)& \" \"&INDEX(G$3:G$52,SMALL(L$3:L$52,ROWS($N$3:P18)+$B$8-1)),\"\"),\"\")","v":""},{"$f":"IFERROR(IF(INDEX(H$3:H$52,SMALL(M$3:M$52,ROWS($N$3:Q18)+$B$9-1))<>\"\",CHAR(149)& \" \"&INDEX(H$3:H$52,SMALL(M$3:M$52,ROWS($N$3:Q18)+$B$9-1)),\"\"),\"\")","v":""}]
["Nein",null,{"$f":"IF('To Do List '!#REF!=Sheet2!$A$15,TRUE,FALSE)","v":{"$error":"#REF!"}},null,{"$f":"IF(AND('To Do List '!C19=\"Ja\",'To Do List '!D19=\"Ja\"),'To Do List '!B19,\"\")","v":""},{"$f":"IF(AND('To Do List '!C19=\"Ja\",'To Do List '!D19=\"Nein\"),'To Do List '!B19,\"\")","v":""},{"$f":"IF(AND('To Do List '!C19=\"Nein\",'To Do List '!D19=\"Ja\"),'To Do List '!B19,\"\")","v":""},{"$f":"IF(AND('To Do List '!C19=\"Nein\",'To Do List '!D19=\"Nein\"),'To Do List '!B19,\"\")","v":""},null,{"$f":"IF(E19<>\"\",ROWS($I$3:I19),\"\")","v":""},{"$f":"IF(F19<>\"\",ROWS($I$3:J19),\"\")","v":""},{"$f":"IF(G19<>\"\",ROWS($I$3:K19),\"\")","v":""},{"$f":"IF(H19<>\"\",ROWS($I$3:L19),\"\")","v":""},null,{"$f":"IFERROR(IF(INDEX(E$3:E$52,SMALL(J$3:J$52,ROWS($N$3:N19)+$B$6-1))<>\"\",CHAR(149)& \" \"&INDEX(E$3:E$52,SMALL(J$3:J$52,ROWS($N$3:N19)+$B$6-1)),\"\"),\"\")","v":""},{"$f":"IFERROR(IF(INDEX(F$3:F$52,SMALL(K$3:K$52,ROWS($N$3:O19)+$B$7-1))<>\"\",CHAR(149)& \" \"&INDEX(F$3:F$52,SMALL(K$3:K$52,ROWS($N$3:O19)+$B$7-1)),\"\"),\"\")","v":""},{"$f":"IFERROR(IF(INDEX(G$3:G$52,SMALL(L$3:L$52,ROWS($N$3:P19)+$B$8-1))<>\"\",CHAR(149)& \" \"&INDEX(G$3:G$52,SMALL(L$3:L$52,ROWS($N$3:P19)+$B$8-1)),\"\"),\"\")","v":""},{"$f":"IFERROR(IF(INDEX(H$3:H$52,SMALL(M$3:M$52,ROWS($N$3:Q19)+$B$9-1))<>\"\",CHAR(149)& \" \"&INDEX(H$3:H$52,SMALL(M$3:M$52,ROWS($N$3:Q19)+$B$9-1)),\"\"),\"\")","v":""}]
[null,null,{"$f":"IF('To Do List '!#REF!=Sheet2!$A$15,TRUE,FALSE)","v":{"$error":"#REF!"}},null,{"$f":"IF(AND('To Do List '!C20=\"Ja\",'To Do List '!D20=\"Ja\"),'To Do List '!B20,\"\")","v":""},{"$f":"IF(AND('To Do List '!C20=\"Ja\",'To Do List '!D20=\"Nein\"),'To Do List '!B20,\"\")","v":""},{"$f":"IF(AND('To Do List '!C20=\"Nein\",'To Do List '!D20=\"Ja\"),'To Do List '!B20,\"\")","v":""},{"$f":"IF(AND('To Do List '!C20=\"Nein\",'To Do List '!D20=\"Nein\"),'To Do List '!B20,\"\")","v":""},null,{"$f":"IF(E20<>\"\",ROWS($I$3:I20),\"\")","v":""},{"$f":"IF(F20<>\"\",ROWS($I$3:J20),\"\")","v":""},{"$f":"IF(G20<>\"\",ROWS($I$3:K20),\"\")","v":""},{"$f":"IF(H20<>\"\",ROWS($I$3:L20),\"\")","v":""},null,{"$f":"IFERROR(IF(INDEX(E$3:E$52,SMALL(J$3:J$52,ROWS($N$3:N20)+$B$6-1))<>\"\",CHAR(149)& \" \"&INDEX(E$3:E$52,SMALL(J$3:J$52,ROWS($N$3:N20)+$B$6-1)),\"\"),\"\")","v":""},{"$f":"IFERROR(IF(INDEX(F$3:F$52,SMALL(K$3:K$52,ROWS($N$3:O20)+$B$7-1))<>\"\",CHAR(149)& \" \"&INDEX(F$3:F$52,SMALL(K$3:K$52,ROWS($N$3:O20)+$B$7-1)),\"\"),\"\")","v":""},{"$f":"IFERROR(IF(INDEX(G$3:G$52,SMALL(L$3:L$52,ROWS($N$3:P20)+$B$8-1))<>\"\",CHAR(149)& \" \"&INDEX(G$3:G$52,SMALL(L$3:L$52,ROWS($N$3:P20)+$B$8-1)),\"\"),\"\")","v":""},{"$f":"IFERROR(IF(INDEX(H$3:H$52,SMALL(M$3:M$52,ROWS($N$3:Q20)+$B$9-1))<>\"\",CHAR(149)& \" \"&INDEX(H$3:H$52,SMALL(M$3:M$52,ROWS($N$3:Q20)+$B$9-1)),\"\"),\"\")","v":""}]
[null,null,{"$f":"IF('To Do List '!#REF!=Sheet2!$A$15,TRUE,FALSE)","v":{"$error":"#REF!"}},null,{"$f":"IF(AND('To Do List '!C21=\"Ja\",'To Do List '!D21=\"Ja\"),'To Do List '!B21,\"\")","v":""},{"$f":"IF(AND('To Do List '!C21=\"Ja\",'To Do List '!D21=\"Nein\"),'To Do List '!B21,\"\")","v":""},{"$f":"IF(AND('To Do List '!C21=\"Nein\",'To Do List '!D21=\"Ja\"),'To Do List '!B21,\"\")","v":""},{"$f":"IF(AND('To Do List '!C21=\"Nein\",'To Do List '!D21=\"Nein\"),'To Do List '!B21,\"\")","v":""},null,{"$f":"IF(E21<>\"\",ROWS($I$3:I21),\"\")","v":""},{"$f":"IF(F21<>\"\",ROWS($I$3:J21),\"\")","v":""},{"$f":"IF(G21<>\"\",ROWS($I$3:K21),\"\")","v":""},{"$f":"IF(H21<>\"\",ROWS($I$3:L21),\"\")","v":""},null,{"$f":"IFERROR(IF(INDEX(E$3:E$52,SMALL(J$3:J$52,ROWS($N$3:N21)+$B$6-1))<>\"\",CHAR(149)& \" \"&INDEX(E$3:E$52,SMALL(J$3:J$52,ROWS($N$3:N21)+$B$6-1)),\"\"),\"\")","v":""},{"$f":"IFERROR(IF(INDEX(F$3:F$52,SMALL(K$3:K$52,ROWS($N$3:O21)+$B$7-1))<>\"\",CHAR(149)& \" \"&INDEX(F$3:F$52,SMALL(K$3:K$52,ROWS($N$3:O21)+$B$7-1)),\"\"),\"\")","v":""},{"$f":"IFERROR(IF(INDEX(G$3:G$52,SMALL(L$3:L$52,ROWS($N$3:P21)+$B$8-1))<>\"\",CHAR(149)& \" \"&INDEX(G$3:G$52,SMALL(L$3:L$52,ROWS($N$3:P21)+$B$8-1)),\"\"),\"\")","v":""},{"$f":"IFERROR(IF(INDEX(H$3:H$52,SMALL(M$3:M$52,ROWS($N$3:Q21)+$B$9-1))<>\"\",CHAR(149)& \" \"&INDEX(H$3:H$52,SMALL(M$3:M$52,ROWS($N$3:Q21)+$B$9-1)),\"\"),\"\")","v":""}]
[null,null,{"$f":"IF('To Do List '!#REF!=Sheet2!$A$15,TRUE,FALSE)","v":{"$error":"#REF!"}},null,{"$f":"IF(AND('To Do List '!C22=\"Ja\",'To Do List '!D22=\"Ja\"),'To Do List '!B22,\"\")","v":""},{"$f":"IF(AND('To Do List '!C22=\"Ja\",'To Do List '!D22=\"Nein\"),'To Do List '!B22,\"\")","v":""},{"$f":"IF(AND('To Do List '!C22=\"Nein\",'To Do List '!D22=\"Ja\"),'To Do List '!B22,\"\")","v":""},{"$f":"IF(AND('To Do List '!C22=\"Nein\",'To Do List '!D22=\"Nein\"),'To Do List '!B22,\"\")","v":""},null,{"$f":"IF(E22<>\"\",ROWS($I$3:I22),\"\")","v":""},{"$f":"IF(F22<>\"\",ROWS($I$3:J22),\"\")","v":""},{"$f":"IF(G22<>\"\",ROWS($I$3:K22),\"\")","v":""},{"$f":"IF(H22<>\"\",ROWS($I$3:L22),\"\")","v":""},null,{"$f":"IFERROR(IF(INDEX(E$3:E$52,SMALL(J$3:J$52,ROWS($N$3:N22)+$B$6-1))<>\"\",CHAR(7)& \" \"&INDEX(E$3:E$52,SMALL(J$3:J$52,ROWS($N$3:N22)+$B$6-1)),\"\"),\"\")","v":""},{"$f":"IFERROR(IF(INDEX(F$3:F$52,SMALL(K$3:K$52,ROWS($N$3:O22)+$B$7-1))<>\"\",CHAR(7)& \" \"&INDEX(F$3:F$52,SMALL(K$3:K$52,ROWS($N$3:O22)+$B$7-1)),\"\"),\"\")","v":""},{"$f":"IFERROR(IF(INDEX(G$3:G$52,SMALL(L$3:L$52,ROWS($N$3:P22)+$B$8-1))<>\"\",CHAR(7)& \" \"&INDEX(G$3:G$52,SMALL(L$3:L$52,ROWS($N$3:P22)+$B$8-1)),\"\"),\"\")","v":""},{"$f":"IFERROR(IF(INDEX(H$3:H$52,SMALL(M$3:M$52,ROWS($N$3:Q22)+$B$9-1))<>\"\",CHAR(7)& \" \"&INDEX(H$3:H$52,SMALL(M$3:M$52,ROWS($N$3:Q22)+$B$9-1)),\"\"),\"\")","v":""}]
[null,null,{"$f":"IF('To Do List '!#REF!=Sheet2!$A$15,TRUE,FALSE)","v":{"$error":"#REF!"}},null,{"$f":"IF(AND('To Do List '!C23=\"Ja\",'To Do List '!D23=\"Ja\"),'To Do List '!B23,\"\")","v":""},{"$f":"IF(AND('To Do List '!C23=\"Ja\",'To Do List '!D23=\"Nein\"),'To Do List '!B23,\"\")","v":""},{"$f":"IF(AND('To Do List '!C23=\"Nein\",'To Do List '!D23=\"Ja\"),'To Do List '!B23,\"\")","v":""},{"$f":"IF(AND('To Do List '!C23=\"Nein\",'To Do List '!D23=\"Nein\"),'To Do List '!B23,\"\")","v":""},null,{"$f":"IF(E23<>\"\",ROWS($I$3:I23),\"\")","v":""},{"$f":"IF(F23<>\"\",ROWS($I$3:J23),\"\")","v":""},{"$f":"IF(G23<>\"\",ROWS($I$3:K23),\"\")","v":""},{"$f":"IF(H23<>\"\",ROWS($I$3:L23),\"\")","v":""},null,{"$f":"IFERROR(IF(INDEX(E$3:E$52,SMALL(J$3:J$52,ROWS($N$3:N23)+$B$6-1))<>\"\",CHAR(7)& \" \"&INDEX(E$3:E$52,SMALL(J$3:J$52,ROWS($N$3:N23)+$B$6-1)),\"\"),\"\")","v":""},{"$f":"IFERROR(IF(INDEX(F$3:F$52,SMALL(K$3:K$52,ROWS($N$3:O23)+$B$7-1))<>\"\",CHAR(7)& \" \"&INDEX(F$3:F$52,SMALL(K$3:K$52,ROWS($N$3:O23)+$B$7-1)),\"\"),\"\")","v":""},{"$f":"IFERROR(IF(INDEX(G$3:G$52,SMALL(L$3:L$52,ROWS($N$3:P23)+$B$8-1))<>\"\",CHAR(7)& \" \"&INDEX(G$3:G$52,SMALL(L$3:L$52,ROWS($N$3:P23)+$B$8-1)),\"\"),\"\")","v":""},{"$f":"IFERROR(IF(INDEX(H$3:H$52,SMALL(M$3:M$52,ROWS($N$3:Q23)+$B$9-1))<>\"\",CHAR(7)& \" \"&INDEX(H$3:H$52,SMALL(M$3:M$52,ROWS($N$3:Q23)+$B$9-1)),\"\"),\"\")","v":""}]
[null,null,{"$f":"IF('To Do List '!#REF!=Sheet2!$A$15,TRUE,FALSE)","v":{"$error":"#REF!"}},null,{"$f":"IF(AND('To Do List '!C24=\"Ja\",'To Do List '!D24=\"Ja\"),'To Do List '!B24,\"\")","v":""},{"$f":"IF(AND('To Do List '!C24=\"Ja\",'To Do List '!D24=\"Nein\"),'To Do List '!B24,\"\")","v":""},{"$f":"IF(AND('To Do List '!C24=\"Nein\",'To Do List '!D24=\"Ja\"),'To Do List '!B24,\"\")","v":""},{"$f":"IF(AND('To Do List '!C24=\"Nein\",'To Do List '!D24=\"Nein\"),'To Do List '!B24,\"\")","v":""},null,{"$f":"IF(E24<>\"\",ROWS($I$3:I24),\"\")","v":""},{"$f":"IF(F24<>\"\",ROWS($I$3:J24),\"\")","v":""},{"$f":"IF(G24<>\"\",ROWS($I$3:K24),\"\")","v":""},{"$f":"IF(H24<>\"\",ROWS($I$3:L24),\"\")","v":""},null,{"$f":"IFERROR(IF(INDEX(E$3:E$52,SMALL(J$3:J$52,ROWS($N$3:N24)+$B$6-1))<>\"\",CHAR(7)& \" \"&INDEX(E$3:E$52,SMALL(J$3:J$52,ROWS($N$3:N24)+$B$6-1)),\"\"),\"\")","v":""},{"$f":"IFERROR(IF(INDEX(F$3:F$52,SMALL(K$3:K$52,ROWS($N$3:O24)+$B$7-1))<>\"\",CHAR(7)& \" \"&INDEX(F$3:F$52,SMALL(K$3:K$52,ROWS($N$3:O24)+$B$7-1)),\"\"),\"\")","v":""},{"$f":"IFERROR(IF(INDEX(G$3:G$52,SMALL(L$3:L$52,ROWS($N$3:P24)+$B$8-1))<>\"\",CHAR(7)& \" \"&INDEX(G$3:G$52,SMALL(L$3:L$52,ROWS($N$3:P24)+$B$8-1)),\"\"),\"\")","v":""},{"$f":"IFERROR(IF(INDEX(H$3:H$52,SMALL(M$3:M$52,ROWS($N$3:Q24)+$B$9-1))<>\"\",CHAR(7)& \" \"&INDEX(H$3:H$52,SMALL(M$3:M$52,ROWS($N$3:Q24)+$B$9-1)),\"\"),\"\")","v":""}]
[null,null,{"$f":"IF('To Do List '!#REF!=Sheet2!$A$15,TRUE,FALSE)","v":{"$error":"#REF!"}},null,{"$f":"IF(AND('To Do List '!C25=\"Ja\",'To Do List '!D25=\"Ja\"),'To Do List '!B25,\"\")","v":""},{"$f":"IF(AND('To Do List '!C25=\"Ja\",'To Do List '!D25=\"Nein\"),'To Do List '!B25,\"\")","v":""},{"$f":"IF(AND('To Do List '!C25=\"Nein\",'To Do List '!D25=\"Ja\"),'To Do List '!B25,\"\")","v":""},{"$f":"IF(AND('To Do List '!C25=\"Nein\",'To Do List '!D25=\"Nein\"),'To Do List '!B25,\"\")","v":""},null,{"$f":"IF(E25<>\"\",ROWS($I$3:I25),\"\")","v":""},{"$f":"IF(F25<>\"\",ROWS($I$3:J25),\"\")","v":""},{"$f":"IF(G25<>\"\",ROWS($I$3:K25),\"\")","v":""},{"$f":"IF(H25<>\"\",ROWS($I$3:L25),\"\")","v":""},null,{"$f":"IFERROR(IF(INDEX(E$3:E$52,SMALL(J$3:J$52,ROWS($N$3:N25)+$B$6-1))<>\"\",CHAR(7)& \" \"&INDEX(E$3:E$52,SMALL(J$3:J$52,ROWS($N$3:N25)+$B$6-1)),\"\"),\"\")","v":""},{"$f":"IFERROR(IF(INDEX(F$3:F$52,SMALL(K$3:K$52,ROWS($N$3:O25)+$B$7-1))<>\"\",CHAR(7)& \" \"&INDEX(F$3:F$52,SMALL(K$3:K$52,ROWS($N$3:O25)+$B$7-1)),\"\"),\"\")","v":""},{"$f":"IFERROR(IF(INDEX(G$3:G$52,SMALL(L$3:L$52,ROWS($N$3:P25)+$B$8-1))<>\"\",CHAR(7)& \" \"&INDEX(G$3:G$52,SMALL(L$3:L$52,ROWS($N$3:P25)+$B$8-1)),\"\"),\"\")","v":""},{"$f":"IFERROR(IF(INDEX(H$3:H$52,SMALL(M$3:M$52,ROWS($N$3:Q25)+$B$9-1))<>\"\",CHAR(7)& \" \"&INDEX(H$3:H$52,SMALL(M$3:M$52,ROWS($N$3:Q25)+$B$9-1)),\"\"),\"\")","v":""}]
[null,null,{"$f":"IF('To Do List '!#REF!=Sheet2!$A$15,TRUE,FALSE)","v":{"$error":"#REF!"}},null,{"$f":"IF(AND('To Do List '!C26=\"Ja\",'To Do List '!D26=\"Ja\"),'To Do List '!B26,\"\")","v":""},{"$f":"IF(AND('To Do List '!C26=\"Ja\",'To Do List '!D26=\"Nein\"),'To Do List '!B26,\"\")","v":""},{"$f":"IF(AND('To Do List '!C26=\"Nein\",'To Do List '!D26=\"Ja\"),'To Do List '!B26,\"\")","v":""},{"$f":"IF(AND('To Do List '!C26=\"Nein\",'To Do List '!D26=\"Nein\"),'To Do List '!B26,\"\")","v":""},null,{"$f":"IF(E26<>\"\",ROWS($I$3:I26),\"\")","v":""},{"$f":"IF(F26<>\"\",ROWS($I$3:J26),\"\")","v":""},{"$f":"IF(G26<>\"\",ROWS($I$3:K26),\"\")","v":""},{"$f":"IF(H26<>\"\",ROWS($I$3:L26),\"\")","v":""},null,{"$f":"IFERROR(IF(INDEX(E$3:E$52,SMALL(J$3:J$52,ROWS($N$3:N26)+$B$6-1))<>\"\",CHAR(7)& \" \"&INDEX(E$3:E$52,SMALL(J$3:J$52,ROWS($N$3:N26)+$B$6-1)),\"\"),\"\")","v":""},{"$f":"IFERROR(IF(INDEX(F$3:F$52,SMALL(K$3:K$52,ROWS($N$3:O26)+$B$7-1))<>\"\",CHAR(7)& \" \"&INDEX(F$3:F$52,SMALL(K$3:K$52,ROWS($N$3:O26)+$B$7-1)),\"\"),\"\")","v":""},{"$f":"IFERROR(IF(INDEX(G$3:G$52,SMALL(L$3:L$52,ROWS($N$3:P26)+$B$8-1))<>\"\",CHAR(7)& \" \"&INDEX(G$3:G$52,SMALL(L$3:L$52,ROWS($N$3:P26)+$B$8-1)),\"\"),\"\")","v":""},{"$f":"IFERROR(IF(INDEX(H$3:H$52,SMALL(M$3:M$52,ROWS($N$3:Q26)+$B$9-1))<>\"\",CHAR(7)& \" \"&INDEX(H$3:H$52,SMALL(M$3:M$52,ROWS($N$3:Q26)+$B$9-1)),\"\"),\"\")","v":""}]
[null,null,{"$f":"IF('To Do List '!#REF!=Sheet2!$A$15,TRUE,FALSE)","v":{"$error":"#REF!"}},null,{"$f":"IF(AND('To Do List '!C27=\"Ja\",'To Do List '!D27=\"Ja\"),'To Do List '!B27,\"\")","v":""},{"$f":"IF(AND('To Do List '!C27=\"Ja\",'To Do List '!D27=\"Nein\"),'To Do List '!B27,\"\")","v":""},{"$f":"IF(AND('To Do List '!C27=\"Nein\",'To Do List '!D27=\"Ja\"),'To Do List '!B27,\"\")","v":""},{"$f":"IF(AND('To Do List '!C27=\"Nein\",'To Do List '!D27=\"Nein\"),'To Do List '!B27,\"\")","v":""},null,{"$f":"IF(E27<>\"\",ROWS($I$3:I27),\"\")","v":""},{"$f":"IF(F27<>\"\",ROWS($I$3:J27),\"\")","v":""},{"$f":"IF(G27<>\"\",ROWS($I$3:K27),\"\")","v":""},{"$f":"IF(H27<>\"\",ROWS($I$3:L27),\"\")","v":""},null,{"$f":"IFERROR(IF(INDEX(E$3:E$52,SMALL(J$3:J$52,ROWS($N$3:N27)+$B$6-1))<>\"\",CHAR(7)& \" \"&INDEX(E$3:E$52,SMALL(J$3:J$52,ROWS($N$3:N27)+$B$6-1)),\"\"),\"\")","v":""},{"$f":"IFERROR(IF(INDEX(F$3:F$52,SMALL(K$3:K$52,ROWS($N$3:O27)+$B$7-1))<>\"\",CHAR(7)& \" \"&INDEX(F$3:F$52,SMALL(K$3:K$52,ROWS($N$3:O27)+$B$7-1)),\"\"),\"\")","v":""},{"$f":"IFERROR(IF(INDEX(G$3:G$52,SMALL(L$3:L$52,ROWS($N$3:P27)+$B$8-1))<>\"\",CHAR(7)& \" \"&INDEX(G$3:G$52,SMALL(L$3:L$52,ROWS($N$3:P27)+$B$8-1)),\"\"),\"\")","v":""},{"$f":"IFERROR(IF(INDEX(H$3:H$52,SMALL(M$3:M$52,ROWS($N$3:Q27)+$B$9-1))<>\"\",CHAR(7)& \" \"&INDEX(H$3:H$52,SMALL(M$3:M$52,ROWS($N$3:Q27)+$B$9-1)),\"\"),\"\")","v":""}]
[null,null,{"$f":"IF('To Do List '!#REF!=Sheet2!$A$15,TRUE,FALSE)","v":{"$error":"#REF!"}},null,{"$f":"IF(AND('To Do List '!C28=\"Ja\",'To Do List '!D28=\"Ja\"),'To Do List '!B28,\"\")","v":""},{"$f":"IF(AND('To Do List '!C28=\"Ja\",'To Do List '!D28=\"Nein\"),'To Do List '!B28,\"\")","v":""},{"$f":"IF(AND('To Do List '!C28=\"Nein\",'To Do List '!D28=\"Ja\"),'To Do List '!B28,\"\")","v":""},{"$f":"IF(AND('To Do List '!C28=\"Nein\",'To Do List '!D28=\"Nein\"),'To Do List '!B28,\"\")","v":""},null,{"$f":"IF(E28<>\"\",ROWS($I$3:I28),\"\")","v":""},{"$f":"IF(F28<>\"\",ROWS($I$3:J28),\"\")","v":""},{"$f":"IF(G28<>\"\",ROWS($I$3:K28),\"\")","v":""},{"$f":"IF(H28<>\"\",ROWS($I$3:L28),\"\")","v":""},null,{"$f":"IFERROR(IF(INDEX(E$3:E$52,SMALL(J$3:J$52,ROWS($N$3:N28)+$B$6-1))<>\"\",CHAR(7)& \" \"&INDEX(E$3:E$52,SMALL(J$3:J$52,ROWS($N$3:N28)+$B$6-1)),\"\"),\"\")","v":""},{"$f":"IFERROR(IF(INDEX(F$3:F$52,SMALL(K$3:K$52,ROWS($N$3:O28)+$B$7-1))<>\"\",CHAR(7)& \" \"&INDEX(F$3:F$52,SMALL(K$3:K$52,ROWS($N$3:O28)+$B$7-1)),\"\"),\"\")","v":""},{"$f":"IFERROR(IF(INDEX(G$3:G$52,SMALL(L$3:L$52,ROWS($N$3:P28)+$B$8-1))<>\"\",CHAR(7)& \" \"&INDEX(G$3:G$52,SMALL(L$3:L$52,ROWS($N$3:P28)+$B$8-1)),\"\"),\"\")","v":""},{"$f":"IFERROR(IF(INDEX(H$3:H$52,SMALL(M$3:M$52,ROWS($N$3:Q28)+$B$9-1))<>\"\",CHAR(7)& \" \"&INDEX(H$3:H$52,SMALL(M$3:M$52,ROWS($N$3:Q28)+$B$9-1)),\"\"),\"\")","v":""}]
[null,null,{"$f":"IF('To Do List '!#REF!=Sheet2!$A$15,TRUE,FALSE)","v":{"$error":"#REF!"}},null,{"$f":"IF(AND('To Do List '!C29=\"Ja\",'To Do List '!D29=\"Ja\"),'To Do List '!B29,\"\")","v":""},{"$f":"IF(AND('To Do List '!C29=\"Ja\",'To Do List '!D29=\"Nein\"),'To Do List '!B29,\"\")","v":""},{"$f":"IF(AND('To Do List '!C29=\"Nein\",'To Do List '!D29=\"Ja\"),'To Do List '!B29,\"\")","v":""},{"$f":"IF(AND('To Do List '!C29=\"Nein\",'To Do List '!D29=\"Nein\"),'To Do List '!B29,\"\")","v":""},null,{"$f":"IF(E29<>\"\",ROWS($I$3:I29),\"\")","v":""},{"$f":"IF(F29<>\"\",ROWS($I$3:J29),\"\")","v":""},{"$f":"IF(G29<>\"\",ROWS($I$3:K29),\"\")","v":""},{"$f":"IF(H29<>\"\",ROWS($I$3:L29),\"\")","v":""},null,{"$f":"IFERROR(IF(INDEX(E$3:E$52,SMALL(J$3:J$52,ROWS($N$3:N29)+$B$6-1))<>\"\",CHAR(7)& \" \"&INDEX(E$3:E$52,SMALL(J$3:J$52,ROWS($N$3:N29)+$B$6-1)),\"\"),\"\")","v":""},{"$f":"IFERROR(IF(INDEX(F$3:F$52,SMALL(K$3:K$52,ROWS($N$3:O29)+$B$7-1))<>\"\",CHAR(7)& \" \"&INDEX(F$3:F$52,SMALL(K$3:K$52,ROWS($N$3:O29)+$B$7-1)),\"\"),\"\")","v":""},{"$f":"IFERROR(IF(INDEX(G$3:G$52,SMALL(L$3:L$52,ROWS($N$3:P29)+$B$8-1))<>\"\",CHAR(7)& \" \"&INDEX(G$3:G$52,SMALL(L$3:L$52,ROWS($N$3:P29)+$B$8-1)),\"\"),\"\")","v":""},{"$f":"IFERROR(IF(INDEX(H$3:H$52,SMALL(M$3:M$52,ROWS($N$3:Q29)+$B$9-1))<>\"\",CHAR(7)& \" \"&INDEX(H$3:H$52,SMALL(M$3:M$52,ROWS($N$3:Q29)+$B$9-1)),\"\"),\"\")","v":""}]
[null,null,{"$f":"IF('To Do List '!#REF!=Sheet2!$A$15,TRUE,FALSE)","v":{"$error":"#REF!"}},null,{"$f":"IF(AND('To Do List '!C30=\"Ja\",'To Do List '!D30=\"Ja\"),'To Do List '!B30,\"\")","v":""},{"$f":"IF(AND('To Do List '!C30=\"Ja\",'To Do List '!D30=\"Nein\"),'To Do List '!B30,\"\")","v":""},{"$f":"IF(AND('To Do List '!C30=\"Nein\",'To Do List '!D30=\"Ja\"),'To Do List '!B30,\"\")","v":""},{"$f":"IF(AND('To Do List '!C30=\"Nein\",'To Do List '!D30=\"Nein\"),'To Do List '!B30,\"\")","v":""},null,{"$f":"IF(E30<>\"\",ROWS($I$3:I30),\"\")","v":""},{"$f":"IF(F30<>\"\",ROWS($I$3:J30),\"\")","v":""},{"$f":"IF(G30<>\"\",ROWS($I$3:K30),\"\")","v":""},{"$f":"IF(H30<>\"\",ROWS($I$3:L30),\"\")","v":""},null,{"$f":"IFERROR(IF(INDEX(E$3:E$52,SMALL(J$3:J$52,ROWS($N$3:N30)+$B$6-1))<>\"\",CHAR(7)& \" \"&INDEX(E$3:E$52,SMALL(J$3:J$52,ROWS($N$3:N30)+$B$6-1)),\"\"),\"\")","v":""},{"$f":"IFERROR(IF(INDEX(F$3:F$52,SMALL(K$3:K$52,ROWS($N$3:O30)+$B$7-1))<>\"\",CHAR(7)& \" \"&INDEX(F$3:F$52,SMALL(K$3:K$52,ROWS($N$3:O30)+$B$7-1)),\"\"),\"\")","v":""},{"$f":"IFERROR(IF(INDEX(G$3:G$52,SMALL(L$3:L$52,ROWS($N$3:P30)+$B$8-1))<>\"\",CHAR(7)& \" \"&INDEX(G$3:G$52,SMALL(L$3:L$52,ROWS($N$3:P30)+$B$8-1)),\"\"),\"\")","v":""},{"$f":"IFERROR(IF(INDEX(H$3:H$52,SMALL(M$3:M$52,ROWS($N$3:Q30)+$B$9-1))<>\"\",CHAR(7)& \" \"&INDEX(H$3:H$52,SMALL(M$3:M$52,ROWS($N$3:Q30)+$B$9-1)),\"\"),\"\")","v":""}]
[null,null,{"$f":"IF('To Do List '!#REF!=Sheet2!$A$15,TRUE,FALSE)","v":{"$error":"#REF!"}},null,{"$f":"IF(AND('To Do List '!C31=\"Ja\",'To Do List '!D31=\"Ja\"),'To Do List '!B31,\"\")","v":""},{"$f":"IF(AND('To Do List '!C31=\"Ja\",'To Do List '!D31=\"Nein\"),'To Do List '!B31,\"\")","v":""},{"$f":"IF(AND('To Do List '!C31=\"Nein\",'To Do List '!D31=\"Ja\"),'To Do List '!B31,\"\")","v":""},{"$f":"IF(AND('To Do List '!C31=\"Nein\",'To Do List '!D31=\"Nein\"),'To Do List '!B31,\"\")","v":""},null,{"$f":"IF(E31<>\"\",ROWS($I$3:I31),\"\")","v":""},{"$f":"IF(F31<>\"\",ROWS($I$3:J31),\"\")","v":""},{"$f":"IF(G31<>\"\",ROWS($I$3:K31),\"\")","v":""},{"$f":"IF(H31<>\"\",ROWS($I$3:L31),\"\")","v":""},null,{"$f":"IFERROR(IF(INDEX(E$3:E$52,SMALL(J$3:J$52,ROWS($N$3:N31)+$B$6-1))<>\"\",CHAR(7)& \" \"&INDEX(E$3:E$52,SMALL(J$3:J$52,ROWS($N$3:N31)+$B$6-1)),\"\"),\"\")","v":""},{"$f":"IFERROR(IF(INDEX(F$3:F$52,SMALL(K$3:K$52,ROWS($N$3:O31)+$B$7-1))<>\"\",CHAR(7)& \" \"&INDEX(F$3:F$52,SMALL(K$3:K$52,ROWS($N$3:O31)+$B$7-1)),\"\"),\"\")","v":""},{"$f":"IFERROR(IF(INDEX(G$3:G$52,SMALL(L$3:L$52,ROWS($N$3:P31)+$B$8-1))<>\"\",CHAR(7)& \" \"&INDEX(G$3:G$52,SMALL(L$3:L$52,ROWS($N$3:P31)+$B$8-1)),\"\"),\"\")","v":""},{"$f":"IFERROR(IF(INDEX(H$3:H$52,SMALL(M$3:M$52,ROWS($N$3:Q31)+$B$9-1))<>\"\",CHAR(7)& \" \"&INDEX(H$3:H$52,SMALL(M$3:M$52,ROWS($N$3:Q31)+$B$9-1)),\"\"),\"\")","v":""}]
[null,null,{"$f":"IF('To Do List '!#REF!=Sheet2!$A$15,TRUE,FALSE)","v":{"$error":"#REF!"}},null,{"$f":"IF(AND('To Do List '!C32=\"Ja\",'To Do List '!D32=\"Ja\"),'To Do List '!B32,\"\")","v":""},{"$f":"IF(AND('To Do List '!C32=\"Ja\",'To Do List '!D32=\"Nein\"),'To Do List '!B32,\"\")","v":""},{"$f":"IF(AND('To Do List '!C32=\"Nein\",'To Do List '!D32=\"Ja\"),'To Do List '!B32,\"\")","v":""},{"$f":"IF(AND('To Do List '!C32=\"Nein\",'To Do List '!D32=\"Nein\"),'To Do List '!B32,\"\")","v":""},null,{"$f":"IF(E32<>\"\",ROWS($I$3:I32),\"\")","v":""},{"$f":"IF(F32<>\"\",ROWS($I$3:J32),\"\")","v":""},{"$f":"IF(G32<>\"\",ROWS($I$3:K32),\"\")","v":""},{"$f":"IF(H32<>\"\",ROWS($I$3:L32),\"\")","v":""},null,{"$f":"IFERROR(IF(INDEX(E$3:E$52,SMALL(J$3:J$52,ROWS($N$3:N32)+$B$6-1))<>\"\",CHAR(7)& \" \"&INDEX(E$3:E$52,SMALL(J$3:J$52,ROWS($N$3:N32)+$B$6-1)),\"\"),\"\")","v":""},{"$f":"IFERROR(IF(INDEX(F$3:F$52,SMALL(K$3:K$52,ROWS($N$3:O32)+$B$7-1))<>\"\",CHAR(7)& \" \"&INDEX(F$3:F$52,SMALL(K$3:K$52,ROWS($N$3:O32)+$B$7-1)),\"\"),\"\")","v":""},{"$f":"IFERROR(IF(INDEX(G$3:G$52,SMALL(L$3:L$52,ROWS($N$3:P32)+$B$8-1))<>\"\",CHAR(7)& \" \"&INDEX(G$3:G$52,SMALL(L$3:L$52,ROWS($N$3:P32)+$B$8-1)),\"\"),\"\")","v":""},{"$f":"IFERROR(IF(INDEX(H$3:H$52,SMALL(M$3:M$52,ROWS($N$3:Q32)+$B$9-1))<>\"\",CHAR(7)& \" \"&INDEX(H$3:H$52,SMALL(M$3:M$52,ROWS($N$3:Q32)+$B$9-1)),\"\"),\"\")","v":""}]
[null,null,{"$f":"IF('To Do List '!#REF!=Sheet2!$A$15,TRUE,FALSE)","v":{"$error":"#REF!"}},null,{"$f":"IF(AND('To Do List '!C33=\"Ja\",'To Do List '!D33=\"Ja\"),'To Do List '!B33,\"\")","v":""},{"$f":"IF(AND('To Do List '!C33=\"Ja\",'To Do List '!D33=\"Nein\"),'To Do List '!B33,\"\")","v":""},{"$f":"IF(AND('To Do List '!C33=\"Nein\",'To Do List '!D33=\"Ja\"),'To Do List '!B33,\"\")","v":""},{"$f":"IF(AND('To Do List '!C33=\"Nein\",'To Do List '!D33=\"Nein\"),'To Do List '!B33,\"\")","v":""},null,{"$f":"IF(E33<>\"\",ROWS($I$3:I33),\"\")","v":""},{"$f":"IF(F33<>\"\",ROWS($I$3:J33),\"\")","v":""},{"$f":"IF(G33<>\"\",ROWS($I$3:K33),\"\")","v":""},{"$f":"IF(H33<>\"\",ROWS($I$3:L33),\"\")","v":""},null,{"$f":"IFERROR(IF(INDEX(E$3:E$52,SMALL(J$3:J$52,ROWS($N$3:N33)+$B$6-1))<>\"\",CHAR(7)& \" \"&INDEX(E$3:E$52,SMALL(J$3:J$52,ROWS($N$3:N33)+$B$6-1)),\"\"),\"\")","v":""},{"$f":"IFERROR(IF(INDEX(F$3:F$52,SMALL(K$3:K$52,ROWS($N$3:O33)+$B$7-1))<>\"\",CHAR(7)& \" \"&INDEX(F$3:F$52,SMALL(K$3:K$52,ROWS($N$3:O33)+$B$7-1)),\"\"),\"\")","v":""},{"$f":"IFERROR(IF(INDEX(G$3:G$52,SMALL(L$3:L$52,ROWS($N$3:P33)+$B$8-1))<>\"\",CHAR(7)& \" \"&INDEX(G$3:G$52,SMALL(L$3:L$52,ROWS($N$3:P33)+$B$8-1)),\"\"),\"\")","v":""},{"$f":"IFERROR(IF(INDEX(H$3:H$52,SMALL(M$3:M$52,ROWS($N$3:Q33)+$B$9-1))<>\"\",CHAR(7)& \" \"&INDEX(H$3:H$52,SMALL(M$3:M$52,ROWS($N$3:Q33)+$B$9-1)),\"\"),\"\")","v":""}]
[null,null,{"$f":"IF('To Do List '!#REF!=Sheet2!$A$15,TRUE,FALSE)","v":{"$error":"#REF!"}},null,{"$f":"IF(AND('To Do List '!C34=\"Ja\",'To Do List '!D34=\"Ja\"),'To Do List '!B34,\"\")","v":""},{"$f":"IF(AND('To Do List '!C34=\"Ja\",'To Do List '!D34=\"Nein\"),'To Do List '!B34,\"\")","v":""},{"$f":"IF(AND('To Do List '!C34=\"Nein\",'To Do List '!D34=\"Ja\"),'To Do List '!B34,\"\")","v":""},{"$f":"IF(AND('To Do List '!C34=\"Nein\",'To Do List '!D34=\"Nein\"),'To Do List '!B34,\"\")","v":""},null,{"$f":"IF(E34<>\"\",ROWS($I$3:I34),\"\")","v":""},{"$f":"IF(F34<>\"\",ROWS($I$3:J34),\"\")","v":""},{"$f":"IF(G34<>\"\",ROWS($I$3:K34),\"\")","v":""},{"$f":"IF(H34<>\"\",ROWS($I$3:L34),\"\")","v":""},null,{"$f":"IFERROR(IF(INDEX(E$3:E$52,SMALL(J$3:J$52,ROWS($N$3:N34)+$B$6-1))<>\"\",CHAR(7)& \" \"&INDEX(E$3:E$52,SMALL(J$3:J$52,ROWS($N$3:N34)+$B$6-1)),\"\"),\"\")","v":""},{"$f":"IFERROR(IF(INDEX(F$3:F$52,SMALL(K$3:K$52,ROWS($N$3:O34)+$B$7-1))<>\"\",CHAR(7)& \" \"&INDEX(F$3:F$52,SMALL(K$3:K$52,ROWS($N$3:O34)+$B$7-1)),\"\"),\"\")","v":""},{"$f":"IFERROR(IF(INDEX(G$3:G$52,SMALL(L$3:L$52,ROWS($N$3:P34)+$B$8-1))<>\"\",CHAR(7)& \" \"&INDEX(G$3:G$52,SMALL(L$3:L$52,ROWS($N$3:P34)+$B$8-1)),\"\"),\"\")","v":""},{"$f":"IFERROR(IF(INDEX(H$3:H$52,SMALL(M$3:M$52,ROWS($N$3:Q34)+$B$9-1))<>\"\",CHAR(7)& \" \"&INDEX(H$3:H$52,SMALL(M$3:M$52,ROWS($N$3:Q34)+$B$9-1)),\"\"),\"\")","v":""}]
[null,null,{"$f":"IF('To Do List '!#REF!=Sheet2!$A$15,TRUE,FALSE)","v":{"$error":"#REF!"}},null,{"$f":"IF(AND('To Do List '!C35=\"Ja\",'To Do List '!D35=\"Ja\"),'To Do List '!B35,\"\")","v":""},{"$f":"IF(AND('To Do List '!C35=\"Ja\",'To Do List '!D35=\"Nein\"),'To Do List '!B35,\"\")","v":""},{"$f":"IF(AND('To Do List '!C35=\"Nein\",'To Do List '!D35=\"Ja\"),'To Do List '!B35,\"\")","v":""},{"$f":"IF(AND('To Do List '!C35=\"Nein\",'To Do List '!D35=\"Nein\"),'To Do List '!B35,\"\")","v":""},null,{"$f":"IF(E35<>\"\",ROWS($I$3:I35),\"\")","v":""},{"$f":"IF(F35<>\"\",ROWS($I$3:J35),\"\")","v":""},{"$f":"IF(G35<>\"\",ROWS($I$3:K35),\"\")","v":""},{"$f":"IF(H35<>\"\",ROWS($I$3:L35),\"\")","v":""},null,{"$f":"IFERROR(IF(INDEX(E$3:E$52,SMALL(J$3:J$52,ROWS($N$3:N35)+$B$6-1))<>\"\",CHAR(7)& \" \"&INDEX(E$3:E$52,SMALL(J$3:J$52,ROWS($N$3:N35)+$B$6-1)),\"\"),\"\")","v":""},{"$f":"IFERROR(IF(INDEX(F$3:F$52,SMALL(K$3:K$52,ROWS($N$3:O35)+$B$7-1))<>\"\",CHAR(7)& \" \"&INDEX(F$3:F$52,SMALL(K$3:K$52,ROWS($N$3:O35)+$B$7-1)),\"\"),\"\")","v":""},{"$f":"IFERROR(IF(INDEX(G$3:G$52,SMALL(L$3:L$52,ROWS($N$3:P35)+$B$8-1))<>\"\",CHAR(7)& \" \"&INDEX(G$3:G$52,SMALL(L$3:L$52,ROWS($N$3:P35)+$B$8-1)),\"\"),\"\")","v":""},{"$f":"IFERROR(IF(INDEX(H$3:H$52,SMALL(M$3:M$52,ROWS($N$3:Q35)+$B$9-1))<>\"\",CHAR(7)& \" \"&INDEX(H$3:H$52,SMALL(M$3:M$52,ROWS($N$3:Q35)+$B$9-1)),\"\"),\"\")","v":""}]
[null,null,{"$f":"IF('To Do List '!#REF!=Sheet2!$A$15,TRUE,FALSE)","v":{"$error":"#REF!"}},null,{"$f":"IF(AND('To Do List '!C36=\"Ja\",'To Do List '!D36=\"Ja\"),'To Do List '!B36,\"\")","v":""},{"$f":"IF(AND('To Do List '!C36=\"Ja\",'To Do List '!D36=\"Nein\"),'To Do List '!B36,\"\")","v":""},{"$f":"IF(AND('To Do List '!C36=\"Nein\",'To Do List '!D36=\"Ja\"),'To Do List '!B36,\"\")","v":""},{"$f":"IF(AND('To Do List '!C36=\"Nein\",'To Do List '!D36=\"Nein\"),'To Do List '!B36,\"\")","v":""},null,{"$f":"IF(E36<>\"\",ROWS($I$3:I36),\"\")","v":""},{"$f":"IF(F36<>\"\",ROWS($I$3:J36),\"\")","v":""},{"$f":"IF(G36<>\"\",ROWS($I$3:K36),\"\")","v":""},{"$f":"IF(H36<>\"\",ROWS($I$3:L36),\"\")","v":""},null,{"$f":"IFERROR(IF(INDEX(E$3:E$52,SMALL(J$3:J$52,ROWS($N$3:N36)+$B$6-1))<>\"\",CHAR(7)& \" \"&INDEX(E$3:E$52,SMALL(J$3:J$52,ROWS($N$3:N36)+$B$6-1)),\"\"),\"\")","v":""},{"$f":"IFERROR(IF(INDEX(F$3:F$52,SMALL(K$3:K$52,ROWS($N$3:O36)+$B$7-1))<>\"\",CHAR(7)& \" \"&INDEX(F$3:F$52,SMALL(K$3:K$52,ROWS($N$3:O36)+$B$7-1)),\"\"),\"\")","v":""},{"$f":"IFERROR(IF(INDEX(G$3:G$52,SMALL(L$3:L$52,ROWS($N$3:P36)+$B$8-1))<>\"\",CHAR(7)& \" \"&INDEX(G$3:G$52,SMALL(L$3:L$52,ROWS($N$3:P36)+$B$8-1)),\"\"),\"\")","v":""},{"$f":"IFERROR(IF(INDEX(H$3:H$52,SMALL(M$3:M$52,ROWS($N$3:Q36)+$B$9-1))<>\"\",CHAR(7)& \" \"&INDEX(H$3:H$52,SMALL(M$3:M$52,ROWS($N$3:Q36)+$B$9-1)),\"\"),\"\")","v":""}]
[null,null,{"$f":"IF('To Do List '!#REF!=Sheet2!$A$15,TRUE,FALSE)","v":{"$error":"#REF!"}},null,{"$f":"IF(AND('To Do List '!C37=\"Ja\",'To Do List '!D37=\"Ja\"),'To Do List '!B37,\"\")","v":""},{"$f":"IF(AND('To Do List '!C37=\"Ja\",'To Do List '!D37=\"Nein\"),'To Do List '!B37,\"\")","v":""},{"$f":"IF(AND('To Do List '!C37=\"Nein\",'To Do List '!D37=\"Ja\"),'To Do List '!B37,\"\")","v":""},{"$f":"IF(AND('To Do List '!C37=\"Nein\",'To Do List '!D37=\"Nein\"),'To Do List '!B37,\"\")","v":""},null,{"$f":"IF(E37<>\"\",ROWS($I$3:I37),\"\")","v":""},{"$f":"IF(F37<>\"\",ROWS($I$3:J37),\"\")","v":""},{"$f":"IF(G37<>\"\",ROWS($I$3:K37),\"\")","v":""},{"$f":"IF(H37<>\"\",ROWS($I$3:L37),\"\")","v":""},null,{"$f":"IFERROR(IF(INDEX(E$3:E$52,SMALL(J$3:J$52,ROWS($N$3:N37)+$B$6-1))<>\"\",CHAR(7)& \" \"&INDEX(E$3:E$52,SMALL(J$3:J$52,ROWS($N$3:N37)+$B$6-1)),\"\"),\"\")","v":""},{"$f":"IFERROR(IF(INDEX(F$3:F$52,SMALL(K$3:K$52,ROWS($N$3:O37)+$B$7-1))<>\"\",CHAR(7)& \" \"&INDEX(F$3:F$52,SMALL(K$3:K$52,ROWS($N$3:O37)+$B$7-1)),\"\"),\"\")","v":""},{"$f":"IFERROR(IF(INDEX(G$3:G$52,SMALL(L$3:L$52,ROWS($N$3:P37)+$B$8-1))<>\"\",CHAR(7)& \" \"&INDEX(G$3:G$52,SMALL(L$3:L$52,ROWS($N$3:P37)+$B$8-1)),\"\"),\"\")","v":""},{"$f":"IFERROR(IF(INDEX(H$3:H$52,SMALL(M$3:M$52,ROWS($N$3:Q37)+$B$9-1))<>\"\",CHAR(7)& \" \"&INDEX(H$3:H$52,SMALL(M$3:M$52,ROWS($N$3:Q37)+$B$9-1)),\"\"),\"\")","v":""}]
[null,null,{"$f":"IF('To Do List '!#REF!=Sheet2!$A$15,TRUE,FALSE)","v":{"$error":"#REF!"}},null,{"$f":"IF(AND('To Do List '!C38=\"Ja\",'To Do List '!D38=\"Ja\"),'To Do List '!B38,\"\")","v":""},{"$f":"IF(AND('To Do List '!C38=\"Ja\",'To Do List '!D38=\"Nein\"),'To Do List '!B38,\"\")","v":""},{"$f":"IF(AND('To Do List '!C38=\"Nein\",'To Do List '!D38=\"Ja\"),'To Do List '!B38,\"\")","v":""},{"$f":"IF(AND('To Do List '!C38=\"Nein\",'To Do List '!D38=\"Nein\"),'To Do List '!B38,\"\")","v":""},null,{"$f":"IF(E38<>\"\",ROWS($I$3:I38),\"\")","v":""},{"$f":"IF(F38<>\"\",ROWS($I$3:J38),\"\")","v":""},{"$f":"IF(G38<>\"\",ROWS($I$3:K38),\"\")","v":""},{"$f":"IF(H38<>\"\",ROWS($I$3:L38),\"\")","v":""},null,{"$f":"IFERROR(IF(INDEX(E$3:E$52,SMALL(J$3:J$52,ROWS($N$3:N38)+$B$6-1))<>\"\",CHAR(7)& \" \"&INDEX(E$3:E$52,SMALL(J$3:J$52,ROWS($N$3:N38)+$B$6-1)),\"\"),\"\")","v":""},{"$f":"IFERROR(IF(INDEX(F$3:F$52,SMALL(K$3:K$52,ROWS($N$3:O38)+$B$7-1))<>\"\",CHAR(7)& \" \"&INDEX(F$3:F$52,SMALL(K$3:K$52,ROWS($N$3:O38)+$B$7-1)),\"\"),\"\")","v":""},{"$f":"IFERROR(IF(INDEX(G$3:G$52,SMALL(L$3:L$52,ROWS($N$3:P38)+$B$8-1))<>\"\",CHAR(7)& \" \"&INDEX(G$3:G$52,SMALL(L$3:L$52,ROWS($N$3:P38)+$B$8-1)),\"\"),\"\")","v":""},{"$f":"IFERROR(IF(INDEX(H$3:H$52,SMALL(M$3:M$52,ROWS($N$3:Q38)+$B$9-1))<>\"\",CHAR(7)& \" \"&INDEX(H$3:H$52,SMALL(M$3:M$52,ROWS($N$3:Q38)+$B$9-1)),\"\"),\"\")","v":""}]
[null,null,{"$f":"IF('To Do List '!#REF!=Sheet2!$A$15,TRUE,FALSE)","v":{"$error":"#REF!"}},null,{"$f":"IF(AND('To Do List '!C39=\"Ja\",'To Do List '!D39=\"Ja\"),'To Do List '!B39,\"\")","v":""},{"$f":"IF(AND('To Do List '!C39=\"Ja\",'To Do List '!D39=\"Nein\"),'To Do List '!B39,\"\")","v":""},{"$f":"IF(AND('To Do List '!C39=\"Nein\",'To Do List '!D39=\"Ja\"),'To Do List '!B39,\"\")","v":""},{"$f":"IF(AND('To Do List '!C39=\"Nein\",'To Do List '!D39=\"Nein\"),'To Do List '!B39,\"\")","v":""},null,{"$f":"IF(E39<>\"\",ROWS($I$3:I39),\"\")","v":""},{"$f":"IF(F39<>\"\",ROWS($I$3:J39),\"\")","v":""},{"$f":"IF(G39<>\"\",ROWS($I$3:K39),\"\")","v":""},{"$f":"IF(H39<>\"\",ROWS($I$3:L39),\"\")","v":""},null,{"$f":"IFERROR(IF(INDEX(E$3:E$52,SMALL(J$3:J$52,ROWS($N$3:N39)+$B$6-1))<>\"\",CHAR(7)& \" \"&INDEX(E$3:E$52,SMALL(J$3:J$52,ROWS($N$3:N39)+$B$6-1)),\"\"),\"\")","v":""},{"$f":"IFERROR(IF(INDEX(F$3:F$52,SMALL(K$3:K$52,ROWS($N$3:O39)+$B$7-1))<>\"\",CHAR(7)& \" \"&INDEX(F$3:F$52,SMALL(K$3:K$52,ROWS($N$3:O39)+$B$7-1)),\"\"),\"\")","v":""},{"$f":"IFERROR(IF(INDEX(G$3:G$52,SMALL(L$3:L$52,ROWS($N$3:P39)+$B$8-1))<>\"\",CHAR(7)& \" \"&INDEX(G$3:G$52,SMALL(L$3:L$52,ROWS($N$3:P39)+$B$8-1)),\"\"),\"\")","v":""},{"$f":"IFERROR(IF(INDEX(H$3:H$52,SMALL(M$3:M$52,ROWS($N$3:Q39)+$B$9-1))<>\"\",CHAR(7)& \" \"&INDEX(H$3:H$52,SMALL(M$3:M$52,ROWS($N$3:Q39)+$B$9-1)),\"\"),\"\")","v":""}]
[null,null,{"$f":"IF('To Do List '!#REF!=Sheet2!$A$15,TRUE,FALSE)","v":{"$error":"#REF!"}},null,{"$f":"IF(AND('To Do List '!C40=\"Ja\",'To Do List '!D40=\"Ja\"),'To Do List '!B40,\"\")","v":""},{"$f":"IF(AND('To Do List '!C40=\"Ja\",'To Do List '!D40=\"Nein\"),'To Do List '!B40,\"\")","v":""},{"$f":"IF(AND('To Do List '!C40=\"Nein\",'To Do List '!D40=\"Ja\"),'To Do List '!B40,\"\")","v":""},{"$f":"IF(AND('To Do List '!C40=\"Nein\",'To Do List '!D40=\"Nein\"),'To Do List '!B40,\"\")","v":""},null,{"$f":"IF(E40<>\"\",ROWS($I$3:I40),\"\")","v":""},{"$f":"IF(F40<>\"\",ROWS($I$3:J40),\"\")","v":""},{"$f":"IF(G40<>\"\",ROWS($I$3:K40),\"\")","v":""},{"$f":"IF(H40<>\"\",ROWS($I$3:L40),\"\")","v":""},null,{"$f":"IFERROR(IF(INDEX(E$3:E$52,SMALL(J$3:J$52,ROWS($N$3:N40)+$B$6-1))<>\"\",CHAR(7)& \" \"&INDEX(E$3:E$52,SMALL(J$3:J$52,ROWS($N$3:N40)+$B$6-1)),\"\"),\"\")","v":""},{"$f":"IFERROR(IF(INDEX(F$3:F$52,SMALL(K$3:K$52,ROWS($N$3:O40)+$B$7-1))<>\"\",CHAR(7)& \" \"&INDEX(F$3:F$52,SMALL(K$3:K$52,ROWS($N$3:O40)+$B$7-1)),\"\"),\"\")","v":""},{"$f":"IFERROR(IF(INDEX(G$3:G$52,SMALL(L$3:L$52,ROWS($N$3:P40)+$B$8-1))<>\"\",CHAR(7)& \" \"&INDEX(G$3:G$52,SMALL(L$3:L$52,ROWS($N$3:P40)+$B$8-1)),\"\"),\"\")","v":""},{"$f":"IFERROR(IF(INDEX(H$3:H$52,SMALL(M$3:M$52,ROWS($N$3:Q40)+$B$9-1))<>\"\",CHAR(7)& \" \"&INDEX(H$3:H$52,SMALL(M$3:M$52,ROWS($N$3:Q40)+$B$9-1)),\"\"),\"\")","v":""}]
[null,null,{"$f":"IF('To Do List '!#REF!=Sheet2!$A$15,TRUE,FALSE)","v":{"$error":"#REF!"}},null,{"$f":"IF(AND('To Do List '!C41=\"Ja\",'To Do List '!D41=\"Ja\"),'To Do List '!B41,\"\")","v":""},{"$f":"IF(AND('To Do List '!C41=\"Ja\",'To Do List '!D41=\"Nein\"),'To Do List '!B41,\"\")","v":""},{"$f":"IF(AND('To Do List '!C41=\"Nein\",'To Do List '!D41=\"Ja\"),'To Do List '!B41,\"\")","v":""},{"$f":"IF(AND('To Do List '!C41=\"Nein\",'To Do List '!D41=\"Nein\"),'To Do List '!B41,\"\")","v":""},null,{"$f":"IF(E41<>\"\",ROWS($I$3:I41),\"\")","v":""},{"$f":"IF(F41<>\"\",ROWS($I$3:J41),\"\")","v":""},{"$f":"IF(G41<>\"\",ROWS($I$3:K41),\"\")","v":""},{"$f":"IF(H41<>\"\",ROWS($I$3:L41),\"\")","v":""},null,{"$f":"IFERROR(IF(INDEX(E$3:E$52,SMALL(J$3:J$52,ROWS($N$3:N41)+$B$6-1))<>\"\",CHAR(7)& \" \"&INDEX(E$3:E$52,SMALL(J$3:J$52,ROWS($N$3:N41)+$B$6-1)),\"\"),\"\")","v":""},{"$f":"IFERROR(IF(INDEX(F$3:F$52,SMALL(K$3:K$52,ROWS($N$3:O41)+$B$7-1))<>\"\",CHAR(7)& \" \"&INDEX(F$3:F$52,SMALL(K$3:K$52,ROWS($N$3:O41)+$B$7-1)),\"\"),\"\")","v":""},{"$f":"IFERROR(IF(INDEX(G$3:G$52,SMALL(L$3:L$52,ROWS($N$3:P41)+$B$8-1))<>\"\",CHAR(7)& \" \"&INDEX(G$3:G$52,SMALL(L$3:L$52,ROWS($N$3:P41)+$B$8-1)),\"\"),\"\")","v":""},{"$f":"IFERROR(IF(INDEX(H$3:H$52,SMALL(M$3:M$52,ROWS($N$3:Q41)+$B$9-1))<>\"\",CHAR(7)& \" \"&INDEX(H$3:H$52,SMALL(M$3:M$52,ROWS($N$3:Q41)+$B$9-1)),\"\"),\"\")","v":""}]
[null,null,{"$f":"IF('To Do List '!#REF!=Sheet2!$A$15,TRUE,FALSE)","v":{"$error":"#REF!"}},null,{"$f":"IF(AND('To Do List '!C42=\"Ja\",'To Do List '!D42=\"Ja\"),'To Do List '!B42,\"\")","v":""},{"$f":"IF(AND('To Do List '!C42=\"Ja\",'To Do List '!D42=\"Nein\"),'To Do List '!B42,\"\")","v":""},{"$f":"IF(AND('To Do List '!C42=\"Nein\",'To Do List '!D42=\"Ja\"),'To Do List '!B42,\"\")","v":""},{"$f":"IF(AND('To Do List '!C42=\"Nein\",'To Do List '!D42=\"Nein\"),'To Do List '!B42,\"\")","v":""},null,{"$f":"IF(E42<>\"\",ROWS($I$3:I42),\"\")","v":""},{"$f":"IF(F42<>\"\",ROWS($I$3:J42),\"\")","v":""},{"$f":"IF(G42<>\"\",ROWS($I$3:K42),\"\")","v":""},{"$f":"IF(H42<>\"\",ROWS($I$3:L42),\"\")","v":""},null,{"$f":"IFERROR(IF(INDEX(E$3:E$52,SMALL(J$3:J$52,ROWS($N$3:N42)+$B$6-1))<>\"\",CHAR(7)& \" \"&INDEX(E$3:E$52,SMALL(J$3:J$52,ROWS($N$3:N42)+$B$6-1)),\"\"),\"\")","v":""},{"$f":"IFERROR(IF(INDEX(F$3:F$52,SMALL(K$3:K$52,ROWS($N$3:O42)+$B$7-1))<>\"\",CHAR(7)& \" \"&INDEX(F$3:F$52,SMALL(K$3:K$52,ROWS($N$3:O42)+$B$7-1)),\"\"),\"\")","v":""},{"$f":"IFERROR(IF(INDEX(G$3:G$52,SMALL(L$3:L$52,ROWS($N$3:P42)+$B$8-1))<>\"\",CHAR(7)& \" \"&INDEX(G$3:G$52,SMALL(L$3:L$52,ROWS($N$3:P42)+$B$8-1)),\"\"),\"\")","v":""},{"$f":"IFERROR(IF(INDEX(H$3:H$52,SMALL(M$3:M$52,ROWS($N$3:Q42)+$B$9-1))<>\"\",CHAR(7)& \" \"&INDEX(H$3:H$52,SMALL(M$3:M$52,ROWS($N$3:Q42)+$B$9-1)),\"\"),\"\")","v":""}]
[null,null,{"$f":"IF('To Do List '!#REF!=Sheet2!$A$15,TRUE,FALSE)","v":{"$error":"#REF!"}},null,{"$f":"IF(AND('To Do List '!C43=\"Ja\",'To Do List '!D43=\"Ja\"),'To Do List '!B43,\"\")","v":""},{"$f":"IF(AND('To Do List '!C43=\"Ja\",'To Do List '!D43=\"Nein\"),'To Do List '!B43,\"\")","v":""},{"$f":"IF(AND('To Do List '!C43=\"Nein\",'To Do List '!D43=\"Ja\"),'To Do List '!B43,\"\")","v":""},{"$f":"IF(AND('To Do List '!C43=\"Nein\",'To Do List '!D43=\"Nein\"),'To Do List '!B43,\"\")","v":""},null,{"$f":"IF(E43<>\"\",ROWS($I$3:I43),\"\")","v":""},{"$f":"IF(F43<>\"\",ROWS($I$3:J43),\"\")","v":""},{"$f":"IF(G43<>\"\",ROWS($I$3:K43),\"\")","v":""},{"$f":"IF(H43<>\"\",ROWS($I$3:L43),\"\")","v":""},null,{"$f":"IFERROR(IF(INDEX(E$3:E$52,SMALL(J$3:J$52,ROWS($N$3:N43)+$B$6-1))<>\"\",CHAR(7)& \" \"&INDEX(E$3:E$52,SMALL(J$3:J$52,ROWS($N$3:N43)+$B$6-1)),\"\"),\"\")","v":""},{"$f":"IFERROR(IF(INDEX(F$3:F$52,SMALL(K$3:K$52,ROWS($N$3:O43)+$B$7-1))<>\"\",CHAR(7)& \" \"&INDEX(F$3:F$52,SMALL(K$3:K$52,ROWS($N$3:O43)+$B$7-1)),\"\"),\"\")","v":""},{"$f":"IFERROR(IF(INDEX(G$3:G$52,SMALL(L$3:L$52,ROWS($N$3:P43)+$B$8-1))<>\"\",CHAR(7)& \" \"&INDEX(G$3:G$52,SMALL(L$3:L$52,ROWS($N$3:P43)+$B$8-1)),\"\"),\"\")","v":""},{"$f":"IFERROR(IF(INDEX(H$3:H$52,SMALL(M$3:M$52,ROWS($N$3:Q43)+$B$9-1))<>\"\",CHAR(7)& \" \"&INDEX(H$3:H$52,SMALL(M$3:M$52,ROWS($N$3:Q43)+$B$9-1)),\"\"),\"\")","v":""}]
[null,null,{"$f":"IF('To Do List '!#REF!=Sheet2!$A$15,TRUE,FALSE)","v":{"$error":"#REF!"}},null,{"$f":"IF(AND('To Do List '!C44=\"Ja\",'To Do List '!D44=\"Ja\"),'To Do List '!B44,\"\")","v":""},{"$f":"IF(AND('To Do List '!C44=\"Ja\",'To Do List '!D44=\"Nein\"),'To Do List '!B44,\"\")","v":""},{"$f":"IF(AND('To Do List '!C44=\"Nein\",'To Do List '!D44=\"Ja\"),'To Do List '!B44,\"\")","v":""},{"$f":"IF(AND('To Do List '!C44=\"Nein\",'To Do List '!D44=\"Nein\"),'To Do List '!B44,\"\")","v":""},null,{"$f":"IF(E44<>\"\",ROWS($I$3:I44),\"\")","v":""},{"$f":"IF(F44<>\"\",ROWS($I$3:J44),\"\")","v":""},{"$f":"IF(G44<>\"\",ROWS($I$3:K44),\"\")","v":""},{"$f":"IF(H44<>\"\",ROWS($I$3:L44),\"\")","v":""},null,{"$f":"IFERROR(IF(INDEX(E$3:E$52,SMALL(J$3:J$52,ROWS($N$3:N44)+$B$6-1))<>\"\",CHAR(7)& \" \"&INDEX(E$3:E$52,SMALL(J$3:J$52,ROWS($N$3:N44)+$B$6-1)),\"\"),\"\")","v":""},{"$f":"IFERROR(IF(INDEX(F$3:F$52,SMALL(K$3:K$52,ROWS($N$3:O44)+$B$7-1))<>\"\",CHAR(7)& \" \"&INDEX(F$3:F$52,SMALL(K$3:K$52,ROWS($N$3:O44)+$B$7-1)),\"\"),\"\")","v":""},{"$f":"IFERROR(IF(INDEX(G$3:G$52,SMALL(L$3:L$52,ROWS($N$3:P44)+$B$8-1))<>\"\",CHAR(7)& \" \"&INDEX(G$3:G$52,SMALL(L$3:L$52,ROWS($N$3:P44)+$B$8-1)),\"\"),\"\")","v":""},{"$f":"IFERROR(IF(INDEX(H$3:H$52,SMALL(M$3:M$52,ROWS($N$3:Q44)+$B$9-1))<>\"\",CHAR(7)& \" \"&INDEX(H$3:H$52,SMALL(M$3:M$52,ROWS($N$3:Q44)+$B$9-1)),\"\"),\"\")","v":""}]
[null,null,{"$f":"IF('To Do List '!#REF!=Sheet2!$A$15,TRUE,FALSE)","v":{"$error":"#REF!"}},null,{"$f":"IF(AND('To Do List '!C45=\"Ja\",'To Do List '!D45=\"Ja\"),'To Do List '!B45,\"\")","v":""},{"$f":"IF(AND('To Do List '!C45=\"Ja\",'To Do List '!D45=\"Nein\"),'To Do List '!B45,\"\")","v":""},{"$f":"IF(AND('To Do List '!C45=\"Nein\",'To Do List '!D45=\"Ja\"),'To Do List '!B45,\"\")","v":""},{"$f":"IF(AND('To Do List '!C45=\"Nein\",'To Do List '!D45=\"Nein\"),'To Do List '!B45,\"\")","v":""},null,{"$f":"IF(E45<>\"\",ROWS($I$3:I45),\"\")","v":""},{"$f":"IF(F45<>\"\",ROWS($I$3:J45),\"\")","v":""},{"$f":"IF(G45<>\"\",ROWS($I$3:K45),\"\")","v":""},{"$f":"IF(H45<>\"\",ROWS($I$3:L45),\"\")","v":""},null,{"$f":"IFERROR(IF(INDEX(E$3:E$52,SMALL(J$3:J$52,ROWS($N$3:N45)+$B$6-1))<>\"\",CHAR(7)& \" \"&INDEX(E$3:E$52,SMALL(J$3:J$52,ROWS($N$3:N45)+$B$6-1)),\"\"),\"\")","v":""},{"$f":"IFERROR(IF(INDEX(F$3:F$52,SMALL(K$3:K$52,ROWS($N$3:O45)+$B$7-1))<>\"\",CHAR(7)& \" \"&INDEX(F$3:F$52,SMALL(K$3:K$52,ROWS($N$3:O45)+$B$7-1)),\"\"),\"\")","v":""},{"$f":"IFERROR(IF(INDEX(G$3:G$52,SMALL(L$3:L$52,ROWS($N$3:P45)+$B$8-1))<>\"\",CHAR(7)& \" \"&INDEX(G$3:G$52,SMALL(L$3:L$52,ROWS($N$3:P45)+$B$8-1)),\"\"),\"\")","v":""},{"$f":"IFERROR(IF(INDEX(H$3:H$52,SMALL(M$3:M$52,ROWS($N$3:Q45)+$B$9-1))<>\"\",CHAR(7)& \" \"&INDEX(H$3:H$52,SMALL(M$3:M$52,ROWS($N$3:Q45)+$B$9-1)),\"\"),\"\")","v":""}]
[null,null,{"$f":"IF('To Do List '!#REF!=Sheet2!$A$15,TRUE,FALSE)","v":{"$error":"#REF!"}},null,{"$f":"IF(AND('To Do List '!C46=\"Ja\",'To Do List '!D46=\"Ja\"),'To Do List '!B46,\"\")","v":""},{"$f":"IF(AND('To Do List '!C46=\"Ja\",'To Do List '!D46=\"Nein\"),'To Do List '!B46,\"\")","v":""},{"$f":"IF(AND('To Do List '!C46=\"Nein\",'To Do List '!D46=\"Ja\"),'To Do List '!B46,\"\")","v":""},{"$f":"IF(AND('To Do List '!C46=\"Nein\",'To Do List '!D46=\"Nein\"),'To Do List '!B46,\"\")","v":""},null,{"$f":"IF(E46<>\"\",ROWS($I$3:I46),\"\")","v":""},{"$f":"IF(F46<>\"\",ROWS($I$3:J46),\"\")","v":""},{"$f":"IF(G46<>\"\",ROWS($I$3:K46),\"\")","v":""},{"$f":"IF(H46<>\"\",ROWS($I$3:L46),\"\")","v":""},null,{"$f":"IFERROR(IF(INDEX(E$3:E$52,SMALL(J$3:J$52,ROWS($N$3:N46)+$B$6-1))<>\"\",CHAR(7)& \" \"&INDEX(E$3:E$52,SMALL(J$3:J$52,ROWS($N$3:N46)+$B$6-1)),\"\"),\"\")","v":""},{"$f":"IFERROR(IF(INDEX(F$3:F$52,SMALL(K$3:K$52,ROWS($N$3:O46)+$B$7-1))<>\"\",CHAR(7)& \" \"&INDEX(F$3:F$52,SMALL(K$3:K$52,ROWS($N$3:O46)+$B$7-1)),\"\"),\"\")","v":""},{"$f":"IFERROR(IF(INDEX(G$3:G$52,SMALL(L$3:L$52,ROWS($N$3:P46)+$B$8-1))<>\"\",CHAR(7)& \" \"&INDEX(G$3:G$52,SMALL(L$3:L$52,ROWS($N$3:P46)+$B$8-1)),\"\"),\"\")","v":""},{"$f":"IFERROR(IF(INDEX(H$3:H$52,SMALL(M$3:M$52,ROWS($N$3:Q46)+$B$9-1))<>\"\",CHAR(7)& \" \"&INDEX(H$3:H$52,SMALL(M$3:M$52,ROWS($N$3:Q46)+$B$9-1)),\"\"),\"\")","v":""}]
[null,null,{"$f":"IF('To Do List '!#REF!=Sheet2!$A$15,TRUE,FALSE)","v":{"$error":"#REF!"}},null,{"$f":"IF(AND('To Do List '!C47=\"Ja\",'To Do List '!D47=\"Ja\"),'To Do List '!B47,\"\")","v":""},{"$f":"IF(AND('To Do List '!C47=\"Ja\",'To Do List '!D47=\"Nein\"),'To Do List '!B47,\"\")","v":""},{"$f":"IF(AND('To Do List '!C47=\"Nein\",'To Do List '!D47=\"Ja\"),'To Do List '!B47,\"\")","v":""},{"$f":"IF(AND('To Do List '!C47=\"Nein\",'To Do List '!D47=\"Nein\"),'To Do List '!B47,\"\")","v":""},null,{"$f":"IF(E47<>\"\",ROWS($I$3:I47),\"\")","v":""},{"$f":"IF(F47<>\"\",ROWS($I$3:J47),\"\")","v":""},{"$f":"IF(G47<>\"\",ROWS($I$3:K47),\"\")","v":""},{"$f":"IF(H47<>\"\",ROWS($I$3:L47),\"\")","v":""},null,{"$f":"IFERROR(IF(INDEX(E$3:E$52,SMALL(J$3:J$52,ROWS($N$3:N47)+$B$6-1))<>\"\",CHAR(7)& \" \"&INDEX(E$3:E$52,SMALL(J$3:J$52,ROWS($N$3:N47)+$B$6-1)),\"\"),\"\")","v":""},{"$f":"IFERROR(IF(INDEX(F$3:F$52,SMALL(K$3:K$52,ROWS($N$3:O47)+$B$7-1))<>\"\",CHAR(7)& \" \"&INDEX(F$3:F$52,SMALL(K$3:K$52,ROWS($N$3:O47)+$B$7-1)),\"\"),\"\")","v":""},{"$f":"IFERROR(IF(INDEX(G$3:G$52,SMALL(L$3:L$52,ROWS($N$3:P47)+$B$8-1))<>\"\",CHAR(7)& \" \"&INDEX(G$3:G$52,SMALL(L$3:L$52,ROWS($N$3:P47)+$B$8-1)),\"\"),\"\")","v":""},{"$f":"IFERROR(IF(INDEX(H$3:H$52,SMALL(M$3:M$52,ROWS($N$3:Q47)+$B$9-1))<>\"\",CHAR(7)& \" \"&INDEX(H$3:H$52,SMALL(M$3:M$52,ROWS($N$3:Q47)+$B$9-1)),\"\"),\"\")","v":""}]
[null,null,{"$f":"IF('To Do List '!#REF!=Sheet2!$A$15,TRUE,FALSE)","v":{"$error":"#REF!"}},null,{"$f":"IF(AND('To Do List '!C48=\"Ja\",'To Do List '!D48=\"Ja\"),'To Do List '!B48,\"\")","v":""},{"$f":"IF(AND('To Do List '!C48=\"Ja\",'To Do List '!D48=\"Nein\"),'To Do List '!B48,\"\")","v":""},{"$f":"IF(AND('To Do List '!C48=\"Nein\",'To Do List '!D48=\"Ja\"),'To Do List '!B48,\"\")","v":""},{"$f":"IF(AND('To Do List '!C48=\"Nein\",'To Do List '!D48=\"Nein\"),'To Do List '!B48,\"\")","v":""},null,{"$f":"IF(E48<>\"\",ROWS($I$3:I48),\"\")","v":""},{"$f":"IF(F48<>\"\",ROWS($I$3:J48),\"\")","v":""},{"$f":"IF(G48<>\"\",ROWS($I$3:K48),\"\")","v":""},{"$f":"IF(H48<>\"\",ROWS($I$3:L48),\"\")","v":""},null,{"$f":"IFERROR(IF(INDEX(E$3:E$52,SMALL(J$3:J$52,ROWS($N$3:N48)+$B$6-1))<>\"\",CHAR(7)& \" \"&INDEX(E$3:E$52,SMALL(J$3:J$52,ROWS($N$3:N48)+$B$6-1)),\"\"),\"\")","v":""},{"$f":"IFERROR(IF(INDEX(F$3:F$52,SMALL(K$3:K$52,ROWS($N$3:O48)+$B$7-1))<>\"\",CHAR(7)& \" \"&INDEX(F$3:F$52,SMALL(K$3:K$52,ROWS($N$3:O48)+$B$7-1)),\"\"),\"\")","v":""},{"$f":"IFERROR(IF(INDEX(G$3:G$52,SMALL(L$3:L$52,ROWS($N$3:P48)+$B$8-1))<>\"\",CHAR(7)& \" \"&INDEX(G$3:G$52,SMALL(L$3:L$52,ROWS($N$3:P48)+$B$8-1)),\"\"),\"\")","v":""},{"$f":"IFERROR(IF(INDEX(H$3:H$52,SMALL(M$3:M$52,ROWS($N$3:Q48)+$B$9-1))<>\"\",CHAR(7)& \" \"&INDEX(H$3:H$52,SMALL(M$3:M$52,ROWS($N$3:Q48)+$B$9-1)),\"\"),\"\")","v":""}]
[null,null,{"$f":"IF('To Do List '!#REF!=Sheet2!$A$15,TRUE,FALSE)","v":{"$error":"#REF!"}},null,{"$f":"IF(AND('To Do List '!C49=\"Ja\",'To Do List '!D49=\"Ja\"),'To Do List '!B49,\"\")","v":""},{"$f":"IF(AND('To Do List '!C49=\"Ja\",'To Do List '!D49=\"Nein\"),'To Do List '!B49,\"\")","v":""},{"$f":"IF(AND('To Do List '!C49=\"Nein\",'To Do List '!D49=\"Ja\"),'To Do List '!B49,\"\")","v":""},{"$f":"IF(AND('To Do List '!C49=\"Nein\",'To Do List '!D49=\"Nein\"),'To Do List '!B49,\"\")","v":""},null,{"$f":"IF(E49<>\"\",ROWS($I$3:I49),\"\")","v":""},{"$f":"IF(F49<>\"\",ROWS($I$3:J49),\"\")","v":""},{"$f":"IF(G49<>\"\",ROWS($I$3:K49),\"\")","v":""},{"$f":"IF(H49<>\"\",ROWS($I$3:L49),\"\")","v":""},null,{"$f":"IFERROR(IF(INDEX(E$3:E$52,SMALL(J$3:J$52,ROWS($N$3:N49)+$B$6-1))<>\"\",CHAR(7)& \" \"&INDEX(E$3:E$52,SMALL(J$3:J$52,ROWS($N$3:N49)+$B$6-1)),\"\"),\"\")","v":""},{"$f":"IFERROR(IF(INDEX(F$3:F$52,SMALL(K$3:K$52,ROWS($N$3:O49)+$B$7-1))<>\"\",CHAR(7)& \" \"&INDEX(F$3:F$52,SMALL(K$3:K$52,ROWS($N$3:O49)+$B$7-1)),\"\"),\"\")","v":""},{"$f":"IFERROR(IF(INDEX(G$3:G$52,SMALL(L$3:L$52,ROWS($N$3:P49)+$B$8-1))<>\"\",CHAR(7)& \" \"&INDEX(G$3:G$52,SMALL(L$3:L$52,ROWS($N$3:P49)+$B$8-1)),\"\"),\"\")","v":""},{"$f":"IFERROR(IF(INDEX(H$3:H$52,SMALL(M$3:M$52,ROWS($N$3:Q49)+$B$9-1))<>\"\",CHAR(7)& \" \"&INDEX(H$3:H$52,SMALL(M$3:M$52,ROWS($N$3:Q49)+$B$9-1)),\"\"),\"\")","v":""}]
[null,null,{"$f":"IF('To Do List '!#REF!=Sheet2!$A$15,TRUE,FALSE)","v":{"$error":"#REF!"}},null,{"$f":"IF(AND('To Do List '!C50=\"Ja\",'To Do List '!D50=\"Ja\"),'To Do List '!B50,\"\")","v":""},{"$f":"IF(AND('To Do List '!C50=\"Ja\",'To Do List '!D50=\"Nein\"),'To Do List '!B50,\"\")","v":""},{"$f":"IF(AND('To Do List '!C50=\"Nein\",'To Do List '!D50=\"Ja\"),'To Do List '!B50,\"\")","v":""},{"$f":"IF(AND('To Do List '!C50=\"Nein\",'To Do List '!D50=\"Nein\"),'To Do List '!B50,\"\")","v":""},null,{"$f":"IF(E50<>\"\",ROWS($I$3:I50),\"\")","v":""},{"$f":"IF(F50<>\"\",ROWS($I$3:J50),\"\")","v":""},{"$f":"IF(G50<>\"\",ROWS($I$3:K50),\"\")","v":""},{"$f":"IF(H50<>\"\",ROWS($I$3:L50),\"\")","v":""},null,{"$f":"IFERROR(IF(INDEX(E$3:E$52,SMALL(J$3:J$52,ROWS($N$3:N52)+$B$6-1))<>\"\",CHAR(7)& \" \"&INDEX(E$3:E$52,SMALL(J$3:J$52,ROWS($N$3:N52)+$B$6-1)),\"\"),\"\")","v":""},{"$f":"IFERROR(IF(INDEX(F$3:F$52,SMALL(K$3:K$52,ROWS($N$3:O52)+$B$7-1))<>\"\",CHAR(7)& \" \"&INDEX(F$3:F$52,SMALL(K$3:K$52,ROWS($N$3:O52)+$B$7-1)),\"\"),\"\")","v":""},{"$f":"IFERROR(IF(INDEX(G$3:G$52,SMALL(L$3:L$52,ROWS($N$3:P50)+$B$8-1))<>\"\",CHAR(7)& \" \"&INDEX(G$3:G$52,SMALL(L$3:L$52,ROWS($N$3:P50)+$B$8-1)),\"\"),\"\")","v":""},{"$f":"IFERROR(IF(INDEX(H$3:H$52,SMALL(M$3:M$52,ROWS($N$3:Q52)+$B$9-1))<>\"\",CHAR(7)& \" \"&INDEX(H$3:H$52,SMALL(M$3:M$52,ROWS($N$3:Q52)+$B$9-1)),\"\"),\"\")","v":""}]
[null,null,{"$f":"IF('To Do List '!#REF!=Sheet2!$A$15,TRUE,FALSE)","v":{"$error":"#REF!"}},null,{"$f":"IF(AND('To Do List '!C51=\"Ja\",'To Do List '!D51=\"Ja\"),'To Do List '!B51,\"\")","v":""},{"$f":"IF(AND('To Do List '!C51=\"Ja\",'To Do List '!D51=\"Nein\"),'To Do List '!B51,\"\")","v":""},{"$f":"IF(AND('To Do List '!C51=\"Nein\",'To Do List '!D51=\"Ja\"),'To Do List '!B51,\"\")","v":""},{"$f":"IF(AND('To Do List '!C51=\"Nein\",'To Do List '!D51=\"Nein\"),'To Do List '!B51,\"\")","v":""},null,{"$f":"IF(E51<>\"\",ROWS($I$3:I51),\"\")","v":""},{"$f":"IF(F51<>\"\",ROWS($I$3:J51),\"\")","v":""},{"$f":"IF(G51<>\"\",ROWS($I$3:K51),\"\")","v":""},{"$f":"IF(H51<>\"\",ROWS($I$3:L51),\"\")","v":""},null,{"$f":"IFERROR(IF(INDEX(E$3:E$52,SMALL(J$3:J$52,ROWS($N$3:N53)+$B$6-1))<>\"\",CHAR(7)& \" \"&INDEX(E$3:E$52,SMALL(J$3:J$52,ROWS($N$3:N53)+$B$6-1)),\"\"),\"\")","v":""},{"$f":"IFERROR(IF(INDEX(F$3:F$52,SMALL(K$3:K$52,ROWS($N$3:O53)+$B$7-1))<>\"\",CHAR(7)& \" \"&INDEX(F$3:F$52,SMALL(K$3:K$52,ROWS($N$3:O53)+$B$7-1)),\"\"),\"\")","v":""},{"$f":"IFERROR(IF(INDEX(G$3:G$52,SMALL(L$3:L$52,ROWS($N$3:P51)+$B$8-1))<>\"\",CHAR(7)& \" \"&INDEX(G$3:G$52,SMALL(L$3:L$52,ROWS($N$3:P51)+$B$8-1)),\"\"),\"\")","v":""},{"$f":"IFERROR(IF(INDEX(H$3:H$52,SMALL(M$3:M$52,ROWS($N$3:Q53)+$B$9-1))<>\"\",CHAR(7)& \" \"&INDEX(H$3:H$52,SMALL(M$3:M$52,ROWS($N$3:Q53)+$B$9-1)),\"\"),\"\")","v":""}]
[null,null,{"$f":"IF('To Do List '!#REF!=Sheet2!$A$15,TRUE,FALSE)","v":{"$error":"#REF!"}},null,{"$f":"IF(AND('To Do List '!C52=\"Ja\",'To Do List '!D52=\"Ja\"),'To Do List '!B52,\"\")","v":""},{"$f":"IF(AND('To Do List '!C52=\"Ja\",'To Do List '!D52=\"Nein\"),'To Do List '!B52,\"\")","v":""},{"$f":"IF(AND('To Do List '!C52=\"Nein\",'To Do List '!D52=\"Ja\"),'To Do List '!B52,\"\")","v":""},{"$f":"IF(AND('To Do List '!C52=\"Nein\",'To Do List '!D52=\"Nein\"),'To Do List '!B52,\"\")","v":""},null,{"$f":"IF(E52<>\"\",ROWS($I$3:I52),\"\")","v":""},{"$f":"IF(F52<>\"\",ROWS($I$3:J52),\"\")","v":""},{"$f":"IF(G52<>\"\",ROWS($I$3:K52),\"\")","v":""},{"$f":"IF(H52<>\"\",ROWS($I$3:L52),\"\")","v":""},null,{"$f":"IFERROR(IF(INDEX(E$3:E$52,SMALL(J$3:J$52,ROWS($N$3:N54)+$B$6-1))<>\"\",CHAR(7)& \" \"&INDEX(E$3:E$52,SMALL(J$3:J$52,ROWS($N$3:N54)+$B$6-1)),\"\"),\"\")","v":""},{"$f":"IFERROR(IF(INDEX(F$3:F$52,SMALL(K$3:K$52,ROWS($N$3:O54)+$B$7-1))<>\"\",CHAR(7)& \" \"&INDEX(F$3:F$52,SMALL(K$3:K$52,ROWS($N$3:O54)+$B$7-1)),\"\"),\"\")","v":""},{"$f":"IFERROR(IF(INDEX(G$3:G$52,SMALL(L$3:L$52,ROWS($N$3:P52)+$B$8-1))<>\"\",CHAR(7)& \" \"&INDEX(G$3:G$52,SMALL(L$3:L$52,ROWS($N$3:P52)+$B$8-1)),\"\"),\"\")","v":""},{"$f":"IFERROR(IF(INDEX(H$3:H$52,SMALL(M$3:M$52,ROWS($N$3:Q54)+$B$9-1))<>\"\",CHAR(7)& \" \"&INDEX(H$3:H$52,SMALL(M$3:M$52,ROWS($N$3:Q54)+$B$9-1)),\"\"),\"\")","v":""}]
[null,null,null,null,null,null,null,null,null,null,null,null,null,null,{"$f":"IF(COUNTIF($O$3:$O$52,\"?*\")>10,COUNTIF($O$3:$O$52,\"?*\"),10)","v":10}]
[]
[]
[]
[]
[null,null,null,null,"Top Right",{"$f":"SUMPRODUCT(--('To Do List '!$C$3:$C$52=\"Yes\"),--('To Do List '!$D$3:$D$52=\"Yes\"))","v":0}]
[null,null,null,null,"Top Left",{"$f":"SUMPRODUCT(--('To Do List '!$C$3:$C$52=\"No\"),--('To Do List '!$D$3:$D$52=\"Yes\"))","v":0}]
[null,null,null,null,"Bottom Right",{"$f":"SUMPRODUCT(--('To Do List '!$C$3:$C$52=\"Yes\"),--('To Do List '!$D$3:$D$52=\"No\"))","v":0}]
[null,null,null,null,"Bottom Left",{"$f":"SUMPRODUCT(--('To Do List '!$C$3:$C$52=\"No\"),--('To Do List '!$D$3:$D$52=\"No\"))","v":0}]

{"sheet":"Task Matrix","index":3,"n_rows":27,"n_cols":5,"rows_kept":27,"cut":false,"hidden":false,"merged":[]}
[]
[]
[]
[]
[null,{"$f":"Sheet2!O3","v":"• Projekt Kickoff planen"},null,null,{"$f":"Sheet2!P3","v":"• Besprechung mit XY durchführen"}]
[null,{"$f":"Sheet2!O4","v":"• Teammeeting planen"},null,null,{"$f":"Sheet2!P4","v":"• Risikomanagement durchführen"}]
[null,{"$f":"Sheet2!O5","v":""},null,null,{"$f":"Sheet2!P5","v":""}]
[null,{"$f":"Sheet2!O6","v":""},null,null,{"$f":"Sheet2!P6","v":""}]
[null,{"$f":"Sheet2!O7","v":""},null,null,{"$f":"Sheet2!P7","v":""}]
[null,{"$f":"Sheet2!O8","v":""},null,null,{"$f":"Sheet2!P8","v":""}]
[null,{"$f":"Sheet2!O9","v":""},null,null,{"$f":"Sheet2!P9","v":""}]
[null,{"$f":"Sheet2!O10","v":""},null,null,{"$f":"Sheet2!P10","v":""}]
[null,{"$f":"Sheet2!O11","v":""},null,null,{"$f":"Sheet2!P11","v":""}]
[null,{"$f":"Sheet2!O12","v":""},null,null,{"$f":"Sheet2!P12","v":""}]
[]
[]
[]
[null,{"$f":"Sheet2!Q3","v":"• Abrechnung machen"},null,null,{"$f":"Sheet2!R3","v":"• CC-Emails lesen"}]
[null,{"$f":"Sheet2!Q4","v":""},null,null,{"$f":"Sheet2!R4","v":""}]
[null,{"$f":"Sheet2!Q5","v":""},null,null,{"$f":"Sheet2!R5","v":""}]
[null,{"$f":"Sheet2!Q6","v":""},null,null,{"$f":"Sheet2!R6","v":""}]
[null,{"$f":"Sheet2!Q7","v":""},null,null,{"$f":"Sheet2!R7","v":""}]
[null,{"$f":"Sheet2!Q8","v":""},null,null,{"$f":"Sheet2!R8","v":""}]
[null,{"$f":"Sheet2!Q9","v":""},null,null,{"$f":"Sheet2!R9","v":""}]
[null,{"$f":"Sheet2!Q10","v":""},null,null,{"$f":"Sheet2!R10","v":""}]
[null,{"$f":"Sheet2!Q11","v":""},null,null,{"$f":"Sheet2!R11","v":""}]
[null,{"$f":"Sheet2!Q12","v":""},null,null,{"$f":"Sheet2!R12","v":""}]